program: Gaussian 09
title: 000092681
version: EM64L-G09RevD.01
frameworkgroup: C1[X(C7H3ClN2O2S)]
method: RPBEPBE
basis: SDD
operation: Freq
keyword: #p
keyword: freq=noraman
keyword: PBEPBE/SDD
title: #p freq=noraman PBEPBE/SDD
converged: NO YES NO NO
title: Mulliken charges:
elementType: Cl S O O N N C C C C C C C H H H
charge: 0.028822 0.187591 -0.195428 -0.194879 0.021311 0.319666 0.443923 -0.503912 0.662282 -0.379036 -0.391503 -0.140240 -0.742229 0.315018 0.297583 0.271031
chargesum: 0.00000
title: Mulliken charges with hydrogens summed into heavy atoms:
elementType: Cl S O O N N C C C C C C C
charge: 0.028822 0.187591 -0.195428 -0.194879 0.021311 0.319666 0.443923 -0.188894 0.662282 -0.081453 -0.391503 0.130791 -0.742229
polarizability: 2.43779523e+02 2.30152247e+01 1.41994666e+02 1.19182801e-02 1.13135429e-02 4.32270367e+01
1716.lowfreq: -8.6524 -3.4813 -2.8195 -0.0020 0.0015 0.0016 18.5068 46.0590 79.1019
frequency: 18.5026 46.0117 79.0933 86.6341 169.8421 216.2866 236.4629 298.2679 301.4122 326.2305 401.0547 423.3670 450.8128 451.4657 507.9401 548.9708 573.6487 651.0849 700.7306 705.3627 727.9435 797.5073 835.2483 933.2710 966.4409 973.3385 1037.8495 1084.2692 1132.6660 1211.5421 1242.8487 1276.7286 1364.5071 1377.9770 1424.7467 1463.7296 1563.0737 1602.9406 2196.6991 3173.8874 3188.9861 3195.9007
redmass: 20.1390 14.1593 8.3316 10.4510 16.2577 7.1670 12.2080 19.2356 6.5424 13.9286 11.9351 8.2426 3.7483 9.8314 7.7935 5.8418 6.6880 7.6822 6.3519 11.2899 3.7558 11.6934 1.3960 1.5201 5.3110 1.3512 6.7452 1.9288 1.4204 8.2060 1.4930 3.1505 6.1151 11.7963 5.1557 3.5568 6.9578 8.3486 12.9065 1.0902 1.0930 1.0966
irintensity: 0.2092 0.0000 0.0023 3.2966 2.6900 1.1910 0.9570 0.2831 1.2616 0.7575 0.1236 0.2322 7.6939 2.7136 11.3129 0.0073 14.5081 18.0488 23.0694 42.1079 1.4977 34.7044 28.4394 36.2033 16.5023 1.4783 87.0490 6.6534 4.1360 333.7384 6.2514 20.6320 6.6968 81.2546 57.4325 102.8269 24.2504 37.0209 1605.5068 2.1420 7.9020 6.7385
temp: 298.150 k
press: 1.00000 atm
elementType: 17 16 8 8 7 7 6 6 6 6 6 6 6 1 1 1
symmnumber: 1
zpe: 239045.5 jmol-1
zpe.correction: 0.091048 hartree
zpe.thermalcorrener: 0.102643 hartree
zpe.thermalcorrenthalpy: 0.103587 hartree
zpe.thermalcorrgfe: 0.050368 hartree
zpe.sumelectzpe: -1385.622541 hartree
zpe.sumelectthermal: -1385.610945 hartree
zpe.sumelectthermalent: -1385.610001 hartree
zpe.sumelectthermalfe: -1385.663220 hartree
dipole: -0.7450 3.0610 0.0031
dipole: 3.1503
quadrupole: -109.1725 -87.1401 -87.5246
quadrupole: 8.8401 0.0128 -0.0020
quadrupole: -14.5601 7.4723 7.0878 8.8401 0.0128 -0.0020
hfenergy: -1385.7135882 hartree
pointgroup: C01 [X(C7H3Cl1N2O2S1)]
dipole: 0.4701804 1.1391689 -0.1320607 debye
dipolederiv: -0.5640163 -0.3831025 0.0489762 -0.2835827 -0.2373469 0.0289874 0.0379042 0.0301177 -0.0089766 -0.9514249 0.6114706 -0.0542606 0.6160341 -0.4294569 0.0359449 -0.055195 0.0363047 -0.0273525 -0.966058 0.1388415 -0.0051557 0.0744317 -0.482137 0.0279729 0.0023662 0.0268709 -0.2221228 -0.6033686 -0.0886803 0.0150049 -0.213377 -0.7789638 0.0640541 0.028827 0.0628242 -0.2274228 1.843002 0.1817351 -0.0425343 0.4199795 1.1502886 -0.1111332 -0.0690807 -0.1080392 0.2025302 -2.1188175 1.2879897 -0.1125719 1.3561498 -0.9757826 0.0852541 -0.1194228 0.0857588 -0.0363922 -0.536323 -0.3016205 0.0413259 -0.2957707 -0.0547217 0.0178875 0.0407345 0.0179396 0.0696523 -0.0546368 0.3984204 -0.0444876 -0.1134922 -0.104454 -0.0001228 0.0115388 -0.0068098 -0.1186124 1.0976098 -0.9865537 0.0952961 -1.026717 0.4577943 -0.0196234 0.0994739 -0.020296 0.1545717 -0.0427979 0.0610157 -0.007666 0.3230532 -0.0162665 -0.0158533 -0.036584 -0.0122597 -0.1198323 0.7435147 0.669628 -0.0835839 0.6359991 0.2639519 -0.0480831 -0.0798565 -0.04811 -0.0948 -0.367754 -0.1304157 0.0182414 -0.0585671 0.0943437 -0.0158607 0.0103674 -0.0150543 -0.0555813 2.2111735 -1.4526658 0.1278996 -1.4804637 0.9362018 -0.0874135 0.1309318 -0.0878293 -0.0408038 0.1435413 -0.0236082 0.0031361 0.0468849 0.0691717 0.0122885 -0.0044725 0.0132399 0.185836 0.0875094 0.0367936 -0.0028256 0.0062901 0.1137772 0.0071217 0.0006662 0.0067042 0.1788768 0.0788465 -0.0192479 0.0032054 -0.0068521 -0.0063996 0.0185788 0.0018015 0.0186384 0.1604298 unknown
polarizability: 234.6409735|-37.1151471|149.9298635|1.4965805|-11.17949|44.4303896 unknown
InChI: InChI=1S/C7H3ClN2O2S/c8-6-2-1-5(10(11)12)3-7(6)9-4-13/h1-3H
charge 0 multiplicity 1
16 atoms
Cl 2.535684 2.180495 -0.288937
S  4.387934 -2.349606 0.17996
O  -3.927743 0.189386 0.014963
O  -2.894122 -1.834285 0.222962
N  -2.875224 -0.552713 0.081421
N  2.023021 -0.800307 0.042906
C  -1.55105 0.117355 -0.01035
C  -0.392806 -0.67675 0.061196
C  0.879977 -0.053322 -0.024021
C  -1.503671 1.519995 -0.165058
C  0.930892 1.367498 -0.180213
C  -0.242326 2.14113 -0.249745
C  3.034031 -1.461025 0.100879
H  -0.473911 -1.759754 0.180972
H  -2.431265 2.094417 -0.215571
H  -0.164821 3.225085 -0.369265
