program: Gaussian 09
title: 000092698
version: EM64L-G09RevD.01
frameworkgroup: C1[X(C21H30N2O)]
method: RPBEPBE
basis: SDD
operation: Freq
keyword: #p
keyword: freq=noraman
keyword: PBEPBE/SDD
title: #p freq=noraman PBEPBE/SDD
converged: YES YES NO NO
title: Mulliken charges:
elementType: O N N C C C C C C C C C C C C C C C C C C C C C H H H H H H H H H H H H H H H H H H H H H H H H H H H H H H
charge: -0.270107 -0.011394 -0.011971 -0.352970 -0.395542 -0.357424 -0.534726 -0.393526 -0.353763 -0.457035 -0.410138 -0.354666 0.466097 -0.025489 -0.314217 -0.452615 -0.447522 -0.694515 0.368813 -0.351726 -0.381464 -0.223493 -0.197618 -0.258675 0.191881 0.192219 0.213399 0.212644 0.191467 0.191346 0.208977 0.210517 0.218203 0.216113 0.193335 0.191819 0.215968 0.219201 0.217004 0.217589 0.195588 0.195618 0.205741 0.206051 0.251692 0.251675 0.216893 0.210668 0.210674 0.247483 0.248993 0.221386 0.225421 0.226119
chargesum: 0.00000
title: Mulliken charges with hydrogens summed into heavy atoms:
elementType: O N N C C C C C C C C C C C C C C C C C C C C C
charge: -0.270107 -0.011394 -0.011971 0.031130 0.030501 0.025389 -0.115232 0.040790 0.031392 -0.021866 0.024456 0.036541 0.466097 -0.025489 0.097576 -0.200923 -0.195848 -0.056280 0.368813 -0.104244 -0.132471 -0.002107 0.027803 -0.032556
polarizability: 3.55614319e+02 7.39578811e+00 2.16458804e+02 -6.56569152e-01 1.34855330e+00 1.72034258e+02
1716.lowfreq: -2.7563 -0.0019 -0.0010 0.0017 6.5123 7.3065 14.6442 17.3191 18.8526
frequency: 13.7936 16.3262 18.6950 20.8607 34.2703 40.0195 48.5119 66.8290 69.6875 75.9024 102.0662 113.0515 118.2306 135.6355 136.4778 139.3388 151.1579 170.2610 223.4852 232.6275 233.3212 244.6394 278.1918 317.1325 348.4521 379.4449 392.5652 401.8958 411.9228 429.6115 453.1410 488.7185 503.5134 518.1319 581.7847 610.5533 617.5974 635.3110 692.3396 722.8401 734.0495 735.8323 757.9242 763.3923 769.1857 785.5308 788.2349 812.3738 821.0646 842.1652 844.8956 874.8605 888.8031 889.2445 924.7732 950.6375 959.4699 960.6496 966.2266 979.3166 980.9606 984.2928 1005.0639 1007.0371 1014.2395 1019.5771 1022.3170 1046.3378 1054.7683 1069.0120 1070.7236 1083.3797 1087.1614 1094.3158 1099.3623 1115.9719 1151.0853 1166.4455 1178.3188 1190.6821 1209.2180 1218.7602 1227.0163 1231.3281 1231.8437 1232.5409 1241.4430 1253.8852 1275.8521 1277.1419 1283.2902 1284.9942 1288.5959 1291.6686 1293.2876 1301.5388 1305.8288 1313.4959 1320.7283 1339.3234 1345.5811 1355.3809 1355.4796 1370.3210 1377.2781 1391.0592 1391.9506 1426.1881 1443.6600 1453.1270 1462.4434 1462.7799 1466.4266 1467.9121 1468.6016 1474.5582 1475.2468 1478.4176 1482.5975 1483.1015 1488.4721 1491.7282 1510.5410 1558.7936 1590.6001 1612.5793 2943.4191 2952.9503 2957.8971 2958.2448 2968.0846 2970.6805 2973.4521 2978.1910 2979.7798 2989.5165 2995.9843 2999.8560 3002.0987 3003.9905 3010.3713 3018.6679 3033.2006 3037.4222 3050.0547 3063.5376 3070.1738 3072.1694 3083.2288 3109.1856 3114.4745 3126.4508 3135.1368 3154.4702 3163.0303 3171.9221
redmass: 4.6166 4.5165 3.7155 4.9457 3.6524 4.5632 1.6516 2.8819 4.2240 3.0823 1.8914 4.6132 1.8053 2.1751 2.1744 4.7775 2.1313 4.4982 4.6637 5.0420 1.1212 3.4529 2.3123 4.0388 4.3752 2.6307 3.5644 3.9403 2.9329 3.1634 4.2304 4.2932 2.8424 3.1384 5.9362 6.3497 3.8608 8.4839 2.0190 1.0638 1.0819 1.1022 1.6472 4.7070 1.1621 1.1949 6.1519 6.0259 1.2513 4.8051 1.3406 1.2505 1.4600 1.9339 1.7214 1.3012 1.3738 1.3539 7.3495 1.2211 1.2969 6.2222 4.7803 4.7124 3.3438 3.6689 2.0468 3.8621 1.4595 2.8196 2.6782 1.5393 2.3014 1.3018 2.9673 2.3685 1.3707 1.0823 1.1699 1.7242 1.7861 3.3802 2.1369 1.4507 2.1010 1.6854 1.5163 1.4140 1.4688 1.1935 1.3685 1.0990 1.0703 1.1344 1.0957 1.1848 1.5690 1.3406 1.4085 1.5560 1.4953 1.5479 1.6167 1.5683 2.0071 1.2144 3.1980 2.8340 2.3787 1.2434 1.0800 1.0683 1.0773 1.0790 1.1527 1.4711 1.0777 1.0421 1.2840 1.0865 1.0899 1.1712 6.0338 5.1105 6.4248 6.2364 1.0549 1.0589 1.0588 1.0588 1.0589 1.0590 1.0366 1.0589 1.0592 1.0974 1.0593 1.1044 1.1014 1.1003 1.0582 1.1023 1.1043 1.1037 1.1046 1.1050 1.1006 1.0993 1.1047 1.0917 1.0931 1.0846 1.0890 1.0925 1.0952 1.1005
irintensity: 0.2298 0.2194 0.1309 0.0291 0.2034 0.0399 0.0303 0.0743 0.3652 1.9803 1.3906 0.3601 0.2202 0.0126 0.0445 0.1367 2.2773 1.1749 1.5357 0.6131 0.0089 0.6194 0.5180 0.4887 1.7636 5.3288 2.2274 0.7472 0.0399 0.0010 1.5957 0.0612 12.2307 3.8404 6.7398 0.9684 3.2497 4.7086 35.5187 11.7889 8.2785 1.1114 86.9272 6.2051 1.6208 2.1098 18.7141 2.3027 0.4252 1.0522 0.2000 0.4490 8.0023 4.7160 8.5786 0.0699 0.0107 0.1617 62.2363 1.1991 0.5425 9.1841 0.1022 3.5689 0.0295 0.5652 23.5399 3.7393 0.8914 0.4773 9.9788 14.1610 1.6888 3.4934 12.0558 22.5795 0.1592 11.8079 49.6068 0.5826 2.0555 268.9094 1.8360 13.5859 9.2236 9.1027 0.1210 1.9338 6.4189 0.8291 1.8169 0.1097 0.4359 0.0408 0.5652 1.7241 1.5258 1.1397 1.5852 6.2356 1.3310 4.1082 2.1944 5.2248 6.6601 11.1430 33.2024 192.8541 2.1346 36.7191 0.2651 0.5758 3.5302 1.3542 31.2251 66.2165 1.6405 12.5949 43.8488 4.6824 26.0060 5.5553 31.3329 16.8248 25.6990 89.9736 27.8903 3.5492 9.0315 28.4646 36.8952 34.8773 34.7367 18.8428 102.2316 0.6692 32.4349 31.6102 0.2471 0.4926 34.4435 1.3873 22.0782 7.8501 85.6898 62.8541 91.3274 55.3704 38.4140 21.5093 33.0624 3.3118 13.1405 36.2421 23.6118 6.0690
temp: 298.150 k
press: 1.00000 atm
elementType: 8 7 7 6 6 6 6 6 6 6 6 6 6 6 6 6 6 6 6 6 6 6 6 6 1 1 1 1 1 1 1 1 1 1 1 1 1 1 1 1 1 1 1 1 1 1 1 1 1 1 1 1 1 1
symmnumber: 1
zpe: 1220623.2 jmol-1
zpe.correction: 0.464911 hartree
zpe.thermalcorrener: 0.490570 hartree
zpe.thermalcorrenthalpy: 0.491514 hartree
zpe.thermalcorrgfe: 0.402622 hartree
zpe.sumelectzpe: -1001.123395 hartree
zpe.sumelectthermal: -1001.097736 hartree
zpe.sumelectthermalent: -1001.096792 hartree
zpe.sumelectthermalfe: -1001.185684 hartree
dipole: 3.5199 -0.5564 0.0632
dipole: 3.5641
quadrupole: -123.8987 -146.2948 -151.8257
quadrupole: 7.7925 0.5888 0.2378
quadrupole: 16.7744 -5.6217 -11.1527 7.7925 0.5888 0.2378
hfenergy: -1001.588306 hartree
pointgroup: C01 [X(C21H30N2O1)]
dipole: 1.3881025 -0.1975704 0.0202519 debye
polarizability: 355.3467159|9.5239412|216.7287801|-1.4436711|1.1038799|172.0318852 unknown
InChI: InChI=1S/C21H30N2O/c1-2-3-4-7-12-19-17-22-21(23-18-19)15-10-6-11-16-24-20-13-8-5-9-14-20/h5,8-9,13-14,17-18H,2-4,6-7,10-12,15-16H2,1H3
charge 0 multiplicity 1
54 atoms
O  -5.243228 0.974977 -0.005299
N  2.186565 -1.975206 1.205867
N  2.277432 -2.018554 -1.223464
C  7.564325 0.646403 0.040489
C  6.058507 0.308739 -0.01806
C  7.8559 2.158323 -0.092678
C  5.787074 -1.217563 0.110353
C  -0.706271 -1.088766 -0.052037
C  -2.226822 -1.358685 -0.065584
C  0.123815 -2.40229 -0.076351
C  -3.057626 -0.055429 -0.043541
C  9.363256 2.494181 -0.021762
C  4.312465 -1.559656 0.061673
C  1.607236 -2.1266 -0.029778
C  -4.562491 -0.332767 -0.035582
C  3.521952 -1.695996 1.231109
C  3.611651 -1.738643 -1.158275
C  9.651092 4.004959 -0.157132
C  -6.64712 0.985108 0.020931
C  -7.458572 -0.177906 0.013539
C  -7.243878 2.271176 0.057386
C  -8.866436 -0.039696 0.043605
C  -8.64669 2.391009 0.086938
C  -9.469092 1.236457 0.080427
H  8.095275 0.098252 -0.765967
H  7.985844 0.274972 0.998141
H  5.522777 0.843312 0.791973
H  5.628762 0.676519 -0.971681
H  7.320898 2.709079 0.708912
H  7.443522 2.530496 -1.053763
H  6.223263 -1.578829 1.062513
H  6.322378 -1.743448 -0.704987
H  -0.438609 -0.510649 0.85447
H  -0.428774 -0.468378 -0.9272
H  -2.484848 -1.952203 -0.967411
H  -2.492021 -1.985769 0.811165
H  -0.149088 -3.019631 0.798563
H  -0.103584 -2.964635 -0.999346
H  -2.801244 0.542142 0.852188
H  -2.812616 0.566029 -0.925966
H  9.773656 2.123294 0.93975
H  9.897529 1.941519 -0.821471
H  -4.851982 -0.924462 0.858602
H  -4.86961 -0.891987 -0.944637
H  3.971793 -1.58691 2.226634
H  4.134517 -1.665704 -2.12086
H  10.734419 4.217561 -0.099316
H  9.151168 4.577494 0.646871
H  9.281806 4.394639 -1.124582
H  -7.015194 -1.177564 -0.015216
H  -6.592596 3.15081 0.062312
H  -9.491117 -0.94041 0.037935
H  -9.10079 3.387968 0.115413
H  -10.55958 1.333319 0.103588
