program: Gaussian 09
title: 000092683
version: EM64L-G09RevD.01
frameworkgroup: C1[X(C14H31N5)]
method: RPBEPBE
basis: SDD
operation: Freq
keyword: #pfreq=noraman
keyword: PBEPBE/SDD
title: #p freq=noraman PBEPBE/SDD
converged: YES YES NO NO
title: Mulliken charges:
elementType: N N N N N C C C C C C C C C C C C C C H H H H H H H H H H H H H H H H H H H H H H H H H H H H H H H
charge: -0.285992 -0.289336 -0.290273 -0.024124 -0.024125 -0.370744 -0.372341 -0.368563 -0.372874 -0.380464 -0.382157 -0.427568 -0.427072 0.154103 0.153997 -0.756958 -0.763283 -0.756917 -0.763298 0.229103 0.161223 0.201841 0.194238 0.163380 0.232262 0.206082 0.194813 0.238109 0.234282 0.235729 0.220831 0.194141 0.218306 0.195944 0.227088 0.184512 0.226377 0.185292 0.233326 0.234631 0.237082 0.222470 0.253684 0.221069 0.233605 0.234613 0.236786 0.222179 0.253640 0.221349
chargesum: 0.00000
title: Mulliken charges with hydrogens summed into heavy atoms:
elementType: N N N N N C C C C C C C C C C C C C C
charge: -0.047883 -0.055054 -0.054544 -0.024124 -0.024125 0.019582 0.023738 0.027079 0.028021 0.034508 0.032093 -0.015967 -0.015403 0.154103 0.153997 -0.051919 -0.066060 -0.051913 -0.066129
polarizability: 2.94818973e+02 5.32101822e-01 1.67479922e+02 -1.36981300e+00 -5.04219494e-01 1.37472518e+02
1716.lowfreq: -6.8746 -5.1151 -2.3493 -0.0018 0.0009 0.0014 5.3897 14.2840 15.7049
frequency: -0.8215 11.9160 14.7554 26.5981 29.5421 43.9686 45.1183 52.0248 60.4967 65.1772 85.7722 94.3679 103.5407 128.8149 130.0295 131.2865 149.9636 154.6048 167.7392 191.7469 192.2995 215.9480 244.8474 276.7770 278.0202 296.0619 330.8554 370.8686 388.3727 433.3621 445.2756 494.6643 496.2511 496.5113 521.9139 568.6305 570.8579 688.5720 692.8325 698.3552 781.4272 781.6133 790.4501 790.7870 811.9936 826.8681 924.4303 924.9073 935.7860 936.4684 955.5932 956.9733 996.4823 1017.0868 1026.7286 1034.0363 1047.9690 1061.1342 1068.3978 1078.4372 1084.3146 1084.7135 1091.6351 1103.5703 1109.8405 1127.2309 1139.4691 1145.3465 1150.9589 1154.0319 1161.2681 1199.8553 1223.1332 1235.8419 1250.9308 1251.5360 1263.0302 1269.5834 1275.9728 1276.4634 1283.1770 1294.4550 1313.2884 1333.2119 1356.5149 1369.7848 1373.9938 1379.0525 1385.9561 1386.8279 1394.1197 1407.4474 1434.2188 1434.6241 1449.5221 1449.6130 1450.5969 1454.4701 1462.5991 1462.7437 1463.1657 1464.2654 1464.3209 1466.8523 1467.2713 1477.4737 1481.5490 1486.3747 1491.6773 1495.8514 1498.7616 1641.7655 1641.9542 2820.0020 2828.4464 2880.2716 2886.5424 2887.7299 2897.6175 2906.0753 2906.3853 2968.5943 2968.6391 2971.7447 2971.8213 2975.4824 2976.3649 2976.5476 3000.7494 3022.8618 3030.5351 3032.3622 3039.7865 3045.0378 3045.2867 3047.7509 3048.1121 3098.0760 3098.1303 3117.3051 3117.3846 3413.1501 3414.3994 3421.6218
redmass: 3.1276 4.1920 4.2801 2.5367 3.1073 1.5189 2.5914 1.3713 1.6111 1.6950 3.1434 2.6147 2.3149 3.0168 2.4465 2.8578 3.4833 2.3359 2.5072 1.1233 1.1138 3.6212 3.8995 2.2718 2.2457 3.6245 2.9687 3.2581 2.6087 3.2705 3.3065 3.0842 2.5646 2.5582 3.9155 3.2776 3.3768 1.2488 1.2905 1.3248 1.1902 1.1891 3.3038 3.4394 1.1288 1.1487 1.2334 1.2345 1.8768 1.8233 2.1380 2.2122 2.9785 2.9803 2.6226 1.7042 2.5557 2.3443 1.8663 2.3397 1.7709 1.7351 2.0132 2.0047 2.2914 2.1705 1.4469 3.1446 1.1917 3.1726 4.5116 1.5770 1.4603 1.3715 3.1405 3.2288 1.1933 1.1512 1.1095 1.1169 1.1544 1.2519 1.3060 1.3391 1.3995 1.3042 1.2434 1.3650 1.2444 1.2481 1.4869 1.5274 1.0857 1.0853 1.0788 1.0804 1.2301 1.2239 1.0578 1.1020 1.1347 1.0577 1.0625 1.0531 1.0526 1.0723 1.0863 1.0952 1.0784 1.0877 1.0846 7.8327 7.8396 1.0721 1.0717 1.0692 1.0710 1.0706 1.0674 1.0615 1.0615 1.0380 1.0381 1.0403 1.0405 1.0872 1.0910 1.0910 1.0949 1.0834 1.0916 1.0914 1.0901 1.0966 1.0966 1.0963 1.0963 1.0989 1.0989 1.0981 1.0982 1.0735 1.0735 1.0737
irintensity: 0.0296 0.0561 0.1182 2.8061 0.1968 0.4999 0.8771 0.8448 0.1184 0.5243 0.7151 1.9685 2.6384 0.7105 5.0104 0.3649 0.8341 5.0130 4.3903 1.0165 3.5747 0.0011 1.6374 13.9158 2.2272 6.9684 0.0521 0.3928 0.9862 9.0933 0.0623 17.3237 1.5013 1.3107 3.4385 17.8701 0.9571 20.2493 96.1563 156.5514 0.4903 3.4105 3.0793 0.0648 2.0489 3.0422 0.2139 0.1617 3.7119 3.8031 4.4187 0.0680 4.5799 9.0234 2.3145 22.2135 0.2620 0.6778 18.0059 48.8739 0.9620 10.6374 1.6595 2.1823 1.3737 3.3345 7.5194 9.4451 9.8200 0.5390 207.6747 7.7741 1.8352 9.2268 7.9543 45.0686 1.1214 0.6219 0.7993 0.4740 26.5343 1.3302 5.5199 1.9435 2.4035 47.0750 4.7335 43.9391 16.9066 17.0133 0.2504 0.7727 13.0435 12.2850 34.0126 26.3701 0.5661 63.1946 16.8734 41.3947 49.2267 9.3018 13.5432 7.7605 9.4717 0.4890 1.2413 7.3856 2.0624 2.7299 4.7798 188.7322 13.9299 176.9613 84.7048 18.6032 97.2962 44.2300 207.2343 46.2900 45.8624 20.4764 18.0626 23.4125 19.5009 1.1674 29.9835 33.1007 81.1711 19.0639 46.1313 34.0218 55.7061 14.4232 11.6586 25.1529 22.8628 36.0393 18.0673 18.0027 19.0159 3.2926 3.3159 2.2454
temp: 298.150 k
press: 1.00000 atm
elementType: 7 7 7 7 7 6 6 6 6 6 6 6 6 6 6 6 6 6 6 1 1 1 1 1 1 1 1 1 1 1 1 1 1 1 1 1 1 1 1 1 1 1 1 1 1 1 1 1 1 1
symmnumber: 1
zpe: 1160182.4 jmol-1
zpe.correction: 0.441890 hartree
zpe.thermalcorrener: 0.466903 hartree
zpe.thermalcorrenthalpy: 0.467848 hartree
zpe.thermalcorrgfe: 0.381359 hartree
zpe.sumelectzpe: -824.198641 hartree
zpe.sumelectthermal: -824.173628 hartree
zpe.sumelectthermalent: -824.172684 hartree
zpe.sumelectthermalfe: -824.259172 hartree
dipole: -0.0130 3.4585 0.8835
dipole: 3.5696
quadrupole: -84.3056 -121.7293 -118.0594
quadrupole: -0.0254 6.6625 -2.0747
quadrupole: 23.7258 -13.6978 -10.0280 -0.0254 6.6625 -2.0747
hfenergy: -824.6405312 hartree
pointgroup: C01 [X(C14H31N5)]
dipole: -0.0060912 1.3649145 0.3305696 debye
polarizability: 294.8224592|0.5595562|167.463027|-1.134751|-0.8781512|137.4859264 unknown
InChI: InChI=1S/C14H31N5/c1-13(2)18-11-9-16-7-5-15-6-8-17-10-12-19-14(3)4/h15-17H,5-12H2,1-4H3
charge 0 multiplicity 1
50 atoms
N  0.000909 -0.461853 0.082994
N  3.719538 0.207751 0.135571
N  -3.718971 0.212177 -0.107305
N  7.426863 -0.463404 -0.021317
N  -7.426698 -0.468591 0.001038
C  1.245195 0.332273 0.060823
C  -1.243465 0.332758 0.016593
C  2.478471 -0.588903 0.06455
C  -2.476912 -0.587496 -0.04087
C  4.970424 -0.577139 0.070566
C  -4.969264 -0.576611 -0.070435
C  6.191031 0.356498 0.027786
C  -6.192148 0.354201 -0.030967
C  8.590977 0.131151 -0.03617
C  -8.59212 0.123535 0.004825
C  8.80011 1.645326 0.00007
C  9.837423 -0.730124 -0.094584
C  -8.80411 1.63744 -0.027831
C  -9.837419 -0.740411 0.046444
H  1.259884 0.944264 -0.860155
H  1.320784 1.04956 0.922022
H  -1.369938 1.042162 0.870614
H  -1.201402 0.94791 -0.906355
H  2.383738 -1.326357 0.906018
H  2.488414 -1.178341 -0.870635
H  -2.351978 -1.297396 -0.893797
H  -2.521418 -1.20136 0.882582
H  -0.012576 -1.112158 0.882282
H  3.711466 0.835586 0.953205
H  -3.703935 0.847618 -0.919099
H  4.957399 -1.183852 -0.854178
H  5.097709 -1.293224 0.918869
H  -4.967803 -1.195527 0.846549
H  -5.083984 -1.281372 -0.929575
H  6.101343 1.022283 -0.857404
H  6.185144 1.022666 0.922396
H  -6.111933 1.012752 0.860562
H  -6.179604 1.027595 -0.919978
H  8.375949 2.079816 0.926838
H  9.868756 1.910305 -0.04831
H  8.27914 2.135748 -0.845265
H  10.434746 -0.49615 -0.997708
H  9.560064 -1.795404 -0.110066
H  10.49041 -0.535642 0.778832
H  -8.365107 2.077519 -0.944951
H  -9.874037 1.899758 0.003741
H  -8.29882 2.124786 0.828782
H  -10.445851 -0.510011 0.943046
H  -9.558157 -1.805193 0.06212
H  -10.480335 -0.544817 -0.834158
