program: Gaussian 09
title: 000092640
version: EM64L-G09RevD.01
frameworkgroup: C1[X(C11H22O2S)]
method: RPBEPBE
basis: SDD
operation: Freq
keyword: #p
keyword: freq=noraman
keyword: PBEPBE/SDD
title: #p freq=noraman PBEPBE/SDD
converged: YES YES NO NO
title: Mulliken charges:
elementType: S O O C C C C C C C C C C C H H H H H H H H H H H H H H H H H H H H H H
charge: -0.011456 -0.266584 -0.245649 -0.019343 -0.424788 -0.407811 -0.365813 -0.343879 -0.353766 -0.718729 -0.697059 0.272434 -0.448016 -0.703926 0.210074 0.201659 0.188529 0.222271 0.208926 0.203144 0.190304 0.230576 0.229776 0.195911 0.194529 0.220926 0.218774 0.217343 0.217499 0.210127 0.210495 0.262656 0.244616 0.293997 0.269562 0.092690
chargesum: 0.00000
title: Mulliken charges with hydrogens summed into heavy atoms:
elementType: S O O C C C C C C C C C C C
charge: 0.081234 -0.266584 -0.245649 0.190731 -0.034599 0.023386 0.027636 0.116472 0.036674 -0.061686 -0.058938 0.272434 0.059256 -0.140367
polarizability: 1.88771389e+02 6.50209512e+00 1.17647903e+02 -1.70152815e+00 -4.75088720e+00 1.23261927e+02
1716.lowfreq: -17.5292 0.0016 0.0022 0.0026 4.3339 7.2689 18.3011 24.2408 34.7757
frequency: 17.2107 24.0417 34.7432 41.4738 58.4495 66.9585 67.8207 106.7053 119.7936 142.8461 170.0174 181.4039 198.0990 228.7842 234.3040 245.0224 259.5535 279.4295 282.8720 309.4580 397.4324 462.9845 490.8107 535.0826 560.7752 636.8814 714.7066 728.7389 732.4666 761.8024 775.9413 806.2345 838.5729 872.3401 890.6096 912.7353 926.1903 959.6950 976.5847 998.3464 1026.4139 1027.2185 1039.1608 1071.0932 1078.1414 1092.3825 1128.3727 1133.5841 1154.1528 1157.9656 1163.9045 1202.0488 1213.1772 1250.8683 1252.8099 1269.7708 1273.6550 1281.4125 1290.9621 1299.1894 1327.5061 1333.7657 1345.0550 1355.4776 1358.8558 1373.7025 1389.7970 1395.1943 1441.9073 1454.4889 1459.0659 1465.2714 1472.8177 1476.0870 1477.3453 1479.6910 1485.3939 1489.7233 1491.7164 1632.8162 2435.7022 2955.4232 2959.2957 2967.4112 2968.9263 2972.7083 2980.5022 2993.1038 2998.5330 3002.5668 3004.2691 3010.3426 3036.0343 3039.0440 3051.9455 3062.6413 3067.1115 3069.2700 3072.1393 3073.2184 3077.1615 3127.1062
redmass: 4.8316 3.6806 2.6141 4.3545 3.1223 1.8582 2.6725 3.8746 2.5960 1.9019 3.6470 3.2912 3.0921 1.1129 1.1275 1.4916 2.5036 3.0041 5.5707 2.2906 3.4592 3.0715 2.6861 2.3924 2.9226 6.2681 2.2821 1.1003 1.4999 1.4505 1.5447 1.3782 1.3888 4.9486 1.9686 1.3073 4.9793 1.6568 2.1698 1.8751 1.4585 1.6167 2.5904 3.9625 2.4492 2.0702 1.8739 2.4046 2.1767 1.2387 2.2796 1.1976 1.4165 1.2587 1.2394 1.2011 1.1560 1.1599 1.0717 1.2477 1.4492 1.5231 1.5230 1.3763 1.5627 1.5519 1.2176 1.2223 1.0809 1.0894 1.0716 1.0720 1.0731 1.0578 1.0429 1.0733 1.0719 1.0511 1.0745 9.8293 1.0383 1.0590 1.0594 1.0790 1.0616 1.0363 1.0365 1.0789 1.0812 1.0618 1.0581 1.1007 1.1038 1.1000 1.0592 1.0981 1.1054 1.1009 1.0993 1.1004 1.0999 1.1065
irintensity: 0.2063 1.9424 0.8075 0.1438 0.2697 0.0873 0.9003 0.1300 0.7657 0.8361 2.8714 1.9621 3.5470 0.0871 28.5688 2.1765 3.0227 12.5127 1.9745 0.8568 0.9352 1.1845 4.6467 2.2374 2.5253 19.1620 8.2237 10.8788 5.3276 10.1060 9.5981 3.7632 19.3724 16.6392 4.1209 2.6746 37.6321 0.4571 7.4282 32.1501 6.7694 3.1830 2.3112 44.9033 4.7725 28.8992 34.5056 263.6583 2.5763 73.4810 0.1741 1.4329 0.8989 0.2519 52.3913 1.6020 4.2911 1.6361 1.1332 0.3868 5.4262 71.9089 3.9961 6.2469 1.2616 2.9239 11.9317 19.1582 16.8847 17.6177 0.5731 0.8106 0.5300 1.1311 13.0862 25.8386 23.2520 8.9224 3.0156 186.0079 30.9928 4.2106 4.6947 12.1827 82.4910 37.5281 26.4482 13.0669 31.8140 9.4115 19.2417 7.0241 65.5714 12.5774 13.1059 4.1532 29.4064 113.0969 54.1125 39.3744 63.0275 8.3580
temp: 298.150 k
press: 1.00000 atm
elementType: 16 8 8 6 6 6 6 6 6 6 6 6 6 6 1 1 1 1 1 1 1 1 1 1 1 1 1 1 1 1 1 1 1 1 1 1
symmnumber: 1
zpe: 813965.1 jmol-1
zpe.correction: 0.310023 hartree
zpe.thermalcorrener: 0.328736 hartree
zpe.thermalcorrenthalpy: 0.329680 hartree
zpe.thermalcorrgfe: 0.259405 hartree
zpe.sumelectzpe: -979.717608 hartree
zpe.sumelectthermal: -979.698895 hartree
zpe.sumelectthermalent: -979.697951 hartree
zpe.sumelectthermalfe: -979.768227 hartree
dipole: -2.9460 0.1657 -1.8041
dipole: 3.4584
quadrupole: -108.6050 -96.3234 -96.5926
quadrupole: -0.2119 -6.8408 4.0173
quadrupole: -8.0980 4.1836 3.9144 -0.2119 -6.8408 4.0173
hfenergy: -980.0276314 hartree
pointgroup: C01 [X(C11H22O2S1)]
dipole: -1.1817902 0.0845316 -0.6690367 debye
polarizability: 188.5678459|6.5807193|117.991054|-3.6295111|-5.1415216|123.1223186 unknown
InChI: InChI=1S/C11H22O2S/c1-3-5-6-10(4-2)9-13-11(12)7-8-14/h10,14H,3-9H2,1-2H3
charge 0 multiplicity 1
36 atoms
S  6.47241 0.232363 -0.950091
O  1.27913 -0.019428 -0.224815
O  2.570388 -1.05726 1.4158
C  -1.167228 0.106685 -0.278214
C  -2.464495 -0.528371 0.297164
C  -1.178517 1.662863 -0.294649
C  -3.754566 -0.135703 -0.457192
C  0.03731 -0.456171 0.490061
C  -5.005721 -0.869344 0.078659
C  -1.438951 2.336583 1.072199
C  -6.298604 -0.478091 -0.668811
C  2.489466 -0.384649 0.361262
C  3.662248 0.162138 -0.443458
C  4.971426 -0.57646 -0.124829
H  -1.06503 -0.231124 -1.331414
H  -2.572606 -0.259745 1.368264
H  -2.362473 -1.633791 0.267519
H  -0.205937 2.00733 -0.694561
H  -1.946725 2.002265 -1.016002
H  -3.920853 0.957721 -0.382412
H  -3.632914 -0.360501 -1.537704
H  0.028939 -1.561709 0.513011
H  0.089276 -0.092481 1.532703
H  -5.121301 -0.648865 1.159736
H  -4.848044 -1.964531 0.000762
H  -2.434301 2.074703 1.475183
H  -1.399817 3.436598 0.972632
H  -0.683146 2.048825 1.826312
H  -7.177899 -1.011953 -0.264081
H  -6.493462 0.607638 -0.582497
H  -6.222866 -0.719814 -1.745826
H  3.773305 1.23734 -0.201907
H  3.414487 0.112029 -1.518924
H  5.190181 -0.540745 0.95347
H  4.927375 -1.634312 -0.427632
H  6.087314 -0.031032 -2.255824
