program: Gaussian 09
title: 000092603
version: EM64L-G09RevD.01
frameworkgroup: C1[X(C12H8ClNO3)]
method: RPBEPBE
basis: SDD
operation: Freq
keyword: #p
keyword: freq=noraman
keyword: PBEPBE/SDD
title: #p freq=noraman PBEPBE/SDD
converged: YES YES NO NO
title: Mulliken charges:
elementType: Cl O O O N C C C C C C C C C C C C H H H H H H H H
charge: 0.006067 -0.270910 -0.210400 -0.208816 0.019781 0.469563 0.350248 0.407325 -0.302961 -0.290163 -0.362501 -0.372031 -0.361211 -0.374973 -0.197919 -0.190168 -0.240366 0.281460 0.312322 0.290726 0.268700 0.264445 0.237042 0.237374 0.237366
chargesum: 0.00000
title: Mulliken charges with hydrogens summed into heavy atoms:
elementType: Cl O O O N C C C C C C C C C C C C
charge: 0.006067 -0.270910 -0.210400 -0.208816 0.019781 0.469563 0.350248 0.407325 -0.302961 -0.008704 -0.050179 -0.081305 -0.092511 -0.110528 0.039123 0.047206 -0.003000
polarizability: 2.62213340e+02 -6.17749277e-01 1.57088737e+02 -1.01388526e+01 -6.43722800e+00 9.14207551e+01
1716.lowfreq: -6.9097 -3.5103 -0.0013 -0.0012 -0.0010 2.4461 22.2117 38.0874 59.0476
frequency: 22.1866 38.0749 59.0415 63.0953 109.4300 156.2212 169.5447 177.8183 229.3009 298.3723 317.2484 345.3945 409.5846 411.8562 426.7749 445.7509 489.5160 521.8745 529.5594 606.4135 608.5319 632.3579 679.2932 686.0987 694.4010 723.4680 734.3532 772.7433 815.7864 832.4861 842.4500 871.4126 916.0029 920.7288 971.6399 979.9000 987.9196 994.3974 1018.9453 1029.0201 1076.1565 1102.4928 1139.8634 1153.1652 1172.8478 1181.6187 1211.3863 1241.2258 1254.5473 1307.2047 1354.3482 1381.6580 1396.0116 1413.6330 1441.7879 1462.8136 1470.6499 1579.0804 1590.8126 1598.9130 1609.6191 3137.3910 3146.3821 3158.4269 3166.6890 3168.5524 3179.0231 3186.2684 3190.8710
redmass: 4.9312 5.4390 6.8352 13.9165 7.2463 15.7088 5.5457 7.5535 6.0833 6.7341 8.9925 10.4160 3.3631 5.0735 8.7232 3.4332 3.7586 6.5855 4.9989 7.0433 5.9415 6.9832 7.1720 4.5517 2.6247 5.3346 4.1656 1.8537 6.3759 1.4415 1.2946 7.1357 1.4052 1.4217 1.3690 1.3375 6.2805 1.3110 2.1469 2.7833 1.5021 3.4493 1.2710 2.1858 1.0701 1.3905 6.4145 3.1168 1.7309 1.3334 7.0353 9.4421 8.6679 5.5903 2.2583 2.8220 2.2978 8.2394 6.8378 6.6953 6.9364 1.0854 1.0890 1.0937 1.0898 1.0967 1.1006 1.0929 1.0961
irintensity: 0.4005 0.2612 0.4289 0.1443 3.8442 1.2811 0.1821 1.7902 0.3393 2.4035 2.7496 1.3186 0.8427 2.2159 0.4890 8.1954 20.3174 1.1648 0.1530 1.5854 1.0438 5.9366 19.7098 31.0417 5.9082 19.5775 39.3122 73.7607 5.0552 18.0152 11.4816 65.7388 8.1034 24.3716 0.6091 1.1536 7.7255 0.4813 14.0580 41.0997 13.0156 32.5532 23.0504 110.6646 4.3990 66.1552 481.6787 463.7997 21.2791 0.5680 46.8140 8.2839 61.5039 46.3343 5.5015 197.6148 68.2520 20.3974 194.7831 21.2468 5.8938 1.4655 6.8941 21.4545 0.3255 12.4384 7.3602 7.9809 3.5865
temp: 298.150 k
press: 1.00000 atm
elementType: 17 8 8 8 7 6 6 6 6 6 6 6 6 6 6 6 6 1 1 1 1 1 1 1 1
symmnumber: 1
zpe: 454655.3 jmol-1
zpe.correction: 0.173169 hartree
zpe.thermalcorrener: 0.187375 hartree
zpe.thermalcorrenthalpy: 0.188319 hartree
zpe.thermalcorrgfe: 0.129499 hartree
zpe.sumelectzpe: -1201.274037 hartree
zpe.sumelectthermal: -1201.259831 hartree
zpe.sumelectthermalent: -1201.258886 hartree
zpe.sumelectthermalfe: -1201.317707 hartree
dipole: 6.6444 -1.0642 -0.1063
dipole: 6.7299
quadrupole: -116.5060 -108.2587 -99.7423
quadrupole: -14.0869 -1.8714 -3.2850
quadrupole: -8.3371 -0.0897 8.4267 -14.0869 -1.8714 -3.2850
hfenergy: -1201.4472056 hartree
pointgroup: C01 [X(C12H8Cl1N1O3)]
dipole: -2.5802098 -0.581325 -0.1229027 debye
dipolederiv: -0.0777137 0.119477 -0.001446 0.1429441 -0.6820212 0.0075715 -0.0091339 0.0089574 -0.0255452 -2.4847583 -0.21414 -0.1263944 -0.1944342 -0.3279478 -0.0555746 0.1655012 -0.0176496 -0.2072329 -0.6896945 0.1989268 -0.0009571 0.4108357 -0.8078668 0.0152188 0.0022424 0.0035102 -0.2296029 -1.0040056 -0.138994 0.0047438 -0.2983998 -0.5424221 0.0047498 0.0117015 0.008283 -0.230379 2.2283294 -0.2423359 -0.002857 -0.3305957 1.1181796 -0.0185352 -0.0209056 -0.0083456 0.1887955 2.0590146 0.0531627 0.0901674 -0.5403199 -0.0601816 -0.0525179 -0.2162868 -0.0525914 0.1263008 1.4469858 0.3447882 0.103197 0.9331722 0.2593035 0.1234124 0.0978274 0.0640909 0.1969064 -1.0592621 0.2007633 -0.0112682 0.2924726 -0.0496048 0.0093597 0.0328613 0.0013058 0.0338824 -0.5840191 -0.2235993 -0.0266058 -0.4154123 1.1260043 -0.011648 -0.034667 -0.0034571 -0.1046082 -0.4490501 -0.0008932 -0.0235879 0.598002 -0.0990551 0.0126222 0.0383376 -0.0019477 -0.1418081 0.2548857 0.0461799 0.0036505 -0.3437637 -0.1663472 -0.0054644 0.0064338 0.0012409 -0.0480213 0.4711545 -0.0482909 -0.0007583 0.1193303 -0.0322173 -0.0056758 -0.0248622 0.0003522 -0.0942417 -0.2849474 0.0034109 -0.0639976 -0.1360898 -0.157957 -0.0093437 -0.1725826 -0.0383724 -0.0948103 -0.3336736 -0.0294841 -0.0275093 -0.075501 -0.08247 0.0631358 0.0145771 0.0921436 -0.0219333 0.0241155 0.0577503 -0.0303641 0.0817657 -0.0388634 0.1019874 -0.0083618 0.1113369 0.0898678 0.0588662 0.0599661 -0.0871301 0.0627486 -0.0805665 0.0532717 -0.1274863 0.040916 0.0422574 -0.0313387 0.107033 0.0238131 0.0757914 -0.0885041 0.0367333 0.0344993 0.0388821 -0.1261087 0.0538462 -0.0428922 0.0144595 -0.0984053 0.0295743 -0.0031601 0.0370617 -0.0015683 0.1441894 0.1165745 -0.0515192 0.0018611 0.0028223 0.1090893 0.0025825 0.0065423 -0.0015357 0.1741892 0.1115657 0.032427 -0.0040137 0.0004318 0.0502518 0.0056023 -0.0179336 -0.0001362 0.1687834 0.0324801 -0.0287861 0.0921227 -0.0414619 0.1174721 -0.0131354 0.1339668 -0.0021709 0.0646808 0.1467259 -0.0406126 -0.0120724 -0.0369807 0.1003593 -0.0849707 -0.0186198 -0.0788177 0.0179304 0.0728428 -0.0283332 -0.000177 -0.0502671 0.0894195 -0.1033711 -0.0278747 -0.1008113 -0.0398575 -0.0323359 -0.0259114 0.1018361 -0.0341481 0.1315577 -0.0248579 0.1143531 -0.020235 0.0175155 -0.0465878 -0.1080931 -0.0167123 -0.1245372 0.0848136 -0.0479925 -0.0171913 -0.0433802 0.0988501 unknown
polarizability: 262.2243901|7.7584703|155.4500857|-3.155438|13.3235758|93.0483566 unknown
InChI: InChI=1S/C12H8ClNO3/c13-11-8-9(14(15)16)6-7-12(11)17-10-4-2-1-3-5-10/h1-8H
charge 0 multiplicity 1
25 atoms
Cl 0.703564 3.324226 0.145433
O  -1.22548 1.088196 0.276436
O  4.436348 -1.891637 0.148991
O  5.088034 0.29719 0.106878
N  4.18103 -0.623708 0.138469
C  0.076177 0.600281 0.206433
C  -2.345843 0.240599 0.007445
C  2.765976 -0.204591 0.164474
C  1.120666 1.566609 0.16799
C  0.408936 -0.779519 0.231561
C  2.464628 1.176497 0.146171
C  1.752812 -1.187032 0.211401
C  -2.460261 -0.450578 -1.218559
C  -3.37569 0.229099 0.9682
C  -3.638089 -1.187956 -1.47232
C  -4.549597 -0.510139 0.697458
C  -4.681994 -1.22247 -0.517435
H  -0.391371 -1.52286 0.279547
H  3.274143 1.909714 0.112656
H  2.029541 -2.243685 0.237053
H  -1.657777 -0.399128 -1.961573
H  -3.252113 0.794828 1.896168
H  -3.74205 -1.725514 -2.420781
H  -5.358211 -0.526918 1.435692
H  -5.593676 -1.793105 -0.722288
