program: Gaussian 09
title: 000092615
version: EM64L-G09RevD.01
frameworkgroup: C1[X(C16H26O)]
method: RPBEPBE
basis: SDD
operation: Freq
keyword: #pfreq=noraman
keyword: PBEPBE/SDD
title: #p freq=noraman PBEPBE/SDD
converged: YES YES NO NO
title: Mulliken charges:
elementType: O C C C C C C C C C C C C C C C C H H H H H H H H H H H H H H H H H H H H H H H H H H
charge: -0.214557 -0.183581 0.317293 0.147226 -0.589380 -0.564944 -0.514825 -0.396704 -0.001032 -0.383631 -0.375129 -0.404583 -0.377058 -0.388918 -0.394256 -0.394193 -0.738125 0.235560 0.216245 0.213885 0.244559 0.249519 0.192596 0.230908 0.204684 0.197865 0.248209 0.181647 0.212257 0.198111 0.195532 0.201984 0.195275 0.184838 0.190016 0.205250 0.190309 0.194988 0.202903 0.196830 0.218095 0.226376 0.227955
chargesum: 0.00000
title: Mulliken charges with hydrogens summed into heavy atoms:
elementType: O C C C C C C C C C C C C C C C C
charge: -0.214557 0.051979 0.317293 0.147226 -0.159249 -0.070867 -0.091321 0.005846 -0.001032 0.046224 0.035239 -0.007066 0.003055 0.006348 -0.008960 0.005541 -0.065699
polarizability: 1.90493070e+02 -3.77997361e+00 1.93753176e+02 -4.66282241e+00 -2.21569595e+00 1.29456138e+02
1716.lowfreq: -14.7775 -11.6741 -0.0003 0.0004 0.0008 6.9300 31.3795 41.3260 60.0615
frequency: 31.1322 41.2566 59.9914 70.3057 113.9161 141.0478 149.9789 166.4813 185.0272 206.8901 242.5373 252.7452 259.0192 270.8283 278.5475 312.1474 327.2416 345.0155 364.0609 391.0718 436.7385 456.6281 498.4130 525.4312 529.9022 568.7410 609.6316 651.0154 692.7872 711.7025 731.2391 758.8360 793.3827 806.2387 815.9011 829.9469 864.4953 884.2645 889.3315 908.1302 927.3181 962.5832 967.7253 975.6339 1007.8219 1026.1130 1032.1034 1055.0719 1060.2079 1065.1630 1083.5601 1086.3570 1098.7749 1107.4781 1114.0071 1134.2936 1145.6857 1157.1515 1175.9830 1181.2212 1207.5569 1218.9187 1237.5728 1241.0677 1260.2203 1272.9209 1281.3296 1282.6967 1288.9845 1295.1639 1297.9460 1301.3443 1313.0125 1324.5117 1326.8777 1337.1485 1342.7007 1345.0993 1352.0083 1356.3122 1358.8875 1387.3537 1435.5278 1455.6665 1461.1160 1462.0687 1463.9333 1466.3371 1469.5064 1473.2401 1474.8962 1476.9458 1484.3794 1490.6220 1496.0840 1606.0352 1638.5297 2956.7705 2960.2630 2963.5371 2966.4128 2969.9073 2976.1458 2977.1237 2978.8347 2982.6327 2985.1303 2986.8935 2992.4837 3004.1200 3008.4976 3010.5808 3018.7067 3025.0862 3029.4765 3035.4720 3040.0752 3043.9492 3045.6482 3061.0240 3064.0950 3075.5846 3076.4397
redmass: 3.1309 2.7598 3.2784 4.5587 2.8269 3.0507 3.7839 2.4392 2.9594 1.4004 2.1982 1.8328 1.8404 2.1245 2.0759 2.5479 2.6424 2.1406 2.3107 2.1338 3.1027 3.0959 2.3728 3.8878 3.0957 2.7581 4.2729 2.8688 1.2883 3.3457 1.2661 1.5538 2.0830 1.9883 2.0037 1.7862 2.4849 2.2671 1.8811 1.8756 1.9239 1.8518 1.6834 1.8973 1.6897 2.1681 1.9006 1.8002 2.6199 2.7746 2.2414 2.4475 1.9189 1.9998 2.2188 1.3724 1.4281 1.4674 1.3520 1.3994 1.4264 1.5348 1.3430 1.4045 1.2203 1.3399 1.2597 1.3112 1.5295 1.4445 1.2837 1.3012 1.2535 1.2147 1.6475 1.4132 1.3806 1.4747 2.2350 1.4619 1.4422 1.2174 1.0879 1.1040 1.0762 1.0875 1.0827 1.0872 1.0678 1.0824 1.0713 1.0903 1.0722 1.0779 1.0882 10.5685 9.5805 1.0597 1.0819 1.0601 1.0612 1.0612 1.0560 1.0420 1.0624 1.0628 1.0614 1.0616 1.0639 1.0973 1.0618 1.0978 1.0982 1.1007 1.0963 1.0978 1.1026 1.0980 1.1000 1.1009 1.1011 1.0993 1.1004
irintensity: 0.1519 0.1815 0.6112 5.2106 0.2037 0.1353 1.2595 0.2352 0.6736 0.2419 0.6031 0.3718 0.3910 1.9391 0.4683 0.7185 3.4467 1.0769 0.3117 0.1946 1.6581 0.1020 1.0784 1.3101 9.0985 3.1689 1.4446 5.5407 12.6065 4.3146 22.0850 2.3998 0.1128 1.6587 0.3490 4.1848 0.0728 0.3268 1.7181 3.5772 2.6583 1.4438 2.1920 1.3776 3.8195 11.5939 2.9332 0.8820 16.6273 10.0894 3.4525 5.7311 2.5401 3.4613 3.1190 2.4656 5.6323 11.4832 1.9911 1.6643 1.3987 20.4226 4.2988 5.3043 0.4391 16.8314 1.5263 4.2641 5.7822 2.7825 1.1786 0.3734 2.2251 3.5728 29.2332 6.7116 0.8103 2.1141 21.0674 0.2197 0.9199 12.0144 18.8645 3.8439 3.8129 6.9442 14.8333 3.3892 9.8318 4.3140 9.6922 2.2392 4.4898 5.3678 37.6477 285.1824 9.3622 34.6804 16.2089 41.1359 9.2714 53.4034 18.8838 42.6877 28.7758 25.8455 33.4376 25.1890 16.4819 17.1984 11.1031 33.0903 4.4878 6.4507 107.4238 17.5209 91.6004 118.7904 85.8132 34.2802 9.3124 30.2695 37.2063
temp: 298.150 k
press: 1.00000 atm
elementType: 8 6 6 6 6 6 6 6 6 6 6 6 6 6 6 6 6 1 1 1 1 1 1 1 1 1 1 1 1 1 1 1 1 1 1 1 1 1 1 1 1 1 1
symmnumber: 1
zpe: 1009383.0 jmol-1
zpe.correction: 0.384454 hartree
zpe.thermalcorrener: 0.402058 hartree
zpe.thermalcorrenthalpy: 0.403003 hartree
zpe.thermalcorrgfe: 0.339235 hartree
zpe.sumelectzpe: -699.177624 hartree
zpe.sumelectthermal: -699.160019 hartree
zpe.sumelectthermalent: -699.159075 hartree
zpe.sumelectthermalfe: -699.222843 hartree
dipole: -0.8221 -4.2635 0.3640
dipole: 4.3573
quadrupole: -103.3372 -115.6080 -104.5325
quadrupole: -10.6975 -0.0915 2.2216
quadrupole: 4.4887 -7.7821 3.2934 -10.6975 -0.0915 2.2216
hfenergy: -699.5620779 hartree
pointgroup: C01 [X(C16H26O1)]
dipole: 0.3427493 1.6721392 0.1590274 debye
polarizability: 190.4005305|-3.7863943|193.7943407|4.6885356|2.7595985|129.5075132 unknown
InChI: InChI=1S/C16H26O/c1-13-12-16(17)15-11-9-7-5-3-2-4-6-8-10-14(13)15/h13H,2-12H2,1H3
charge 0 multiplicity 1
43 atoms
O  -2.315703 -2.77194 -0.449222
C  -2.801245 0.885384 -0.383624
C  -1.47655 0.593449 0.342735
C  -1.179527 -0.753113 0.361172
C  -0.66178 1.718143 0.940148
C  -3.324998 -0.516167 -0.802423
C  0.030624 -1.462671 0.919338
C  0.053826 2.623325 -0.117272
C  -2.265454 -1.515579 -0.312021
C  0.922973 -2.075167 -0.20475
C  1.307688 1.9737 -0.756239
C  2.363672 -2.414937 0.2553
C  2.529983 1.941692 0.194783
C  3.23924 -1.170935 0.569157
C  3.776155 1.208028 -0.369501
C  3.564994 -0.299102 -0.675317
C  -3.81747 1.677915 0.478293
H  -2.584676 1.493494 -1.286977
H  -1.333888 2.361453 1.542612
H  0.0934 1.315882 1.639843
H  -3.460266 -0.622285 -1.894005
H  -4.298933 -0.753351 -0.335386
H  0.626328 -0.767428 1.538693
H  -0.302687 -2.286531 1.580551
H  -0.671977 2.898868 -0.907691
H  0.349642 3.57002 0.378316
H  0.421574 -2.982688 -0.587761
H  0.967618 -1.36801 -1.055975
H  1.049806 0.949175 -1.087123
H  1.584625 2.53624 -1.671163
H  2.314751 -3.065073 1.153014
H  2.858706 -3.013476 -0.536709
H  2.813721 2.986677 0.437692
H  2.238216 1.478042 1.158302
H  2.723387 -0.555977 1.331882
H  4.185442 -1.499889 1.043236
H  4.100503 1.719165 -1.2997
H  4.60986 1.318805 0.354472
H  4.474904 -0.695665 -1.168398
H  2.754814 -0.398409 -1.422345
H  -3.432504 2.675154 0.758995
H  -4.757937 1.829197 -0.081899
H  -4.056759 1.126988 1.406866
