program: Gaussian 09
title: 000092617
version: EM64L-G09RevD.01
frameworkgroup: C1[X(C10H7Cl5)]
method: RPBEPBE
basis: SDD
operation: Freq
keyword: #pfreq=noraman
keyword: PBEPBE/SDD
title: #p freq=noraman PBEPBE/SDD
converged: NO YES NO NO
title: Mulliken charges:
elementType: Cl Cl Cl Cl Cl C C C C C C C C C C H H H H H H H
charge: 0.095009 0.091184 0.106556 -0.047326 -0.045680 -0.488166 0.461289 0.403615 -0.571952 -0.390230 -0.366101 -0.082561 -0.072989 -0.689373 -0.245165 0.275802 0.266445 0.279185 0.251819 0.239688 0.242554 0.286397
chargesum: 0.00000
title: Mulliken charges with hydrogens summed into heavy atoms:
elementType: Cl Cl Cl Cl Cl C C C C C C C C C C
charge: 0.095009 0.091184 0.106556 -0.047326 -0.045680 0.054081 0.461289 0.403615 -0.571952 -0.111045 -0.114283 -0.082561 -0.072989 -0.207130 0.041232
polarizability: 1.85771085e+02 1.36449123e+00 1.80172773e+02 -3.27342654e+01 -7.06564291e+00 1.03314429e+02
1716.lowfreq: -0.0016 -0.0007 -0.0004 0.9436 4.3938 6.6692 19.3698 28.7002 42.4943
frequency: 19.3216 28.6859 42.4851 122.2748 123.8786 131.6058 154.1029 175.9930 197.6033 205.2293 212.6207 260.3977 283.8546 325.0454 340.0814 359.5543 393.3593 408.8831 422.2251 476.9234 516.1380 531.5881 555.5583 619.1998 636.9997 668.5649 721.7486 741.7027 753.8362 827.2128 861.2571 881.0241 896.3150 942.9586 965.9397 971.0612 980.0848 1046.3556 1095.3922 1111.5421 1126.2894 1233.3918 1260.5388 1301.6631 1326.8819 1364.0183 1403.9037 1421.9432 1446.7002 1449.9394 1555.0620 1596.2237 1637.3559 3024.3151 3083.7048 3107.5330 3169.4112 3175.7055 3189.9508 3212.4172
redmass: 22.1832 12.3998 17.3728 9.2500 5.2496 12.7686 16.7282 6.0990 8.2939 4.7049 7.7562 19.7749 8.3463 11.2834 6.1904 4.8695 4.1589 7.4949 4.9811 4.3253 5.2213 3.1916 4.0829 5.2591 5.7124 2.1418 1.4578 4.0403 8.2149 6.0629 1.4575 1.5039 1.4541 2.0073 1.4660 1.9085 5.4669 5.2811 1.5153 1.8236 2.8840 1.2213 1.2097 2.2881 1.3984 7.4901 3.0583 1.4854 1.5263 1.4437 6.5987 7.4500 4.8544 1.0594 1.1017 1.0628 1.0918 1.0928 1.0941 1.1147
irintensity: 0.1038 0.3155 0.1516 0.2922 0.4271 0.2184 0.4288 0.2900 0.7085 0.1353 0.3182 0.1127 1.0647 0.5398 2.5483 5.8867 1.8502 7.8913 6.0491 4.8854 0.6356 21.5259 6.9283 68.8762 107.8167 34.0578 14.8949 61.0263 99.0785 51.3898 32.4842 14.0494 18.3592 9.1493 54.2997 40.9899 0.6777 31.2131 10.7841 12.4133 1.0988 27.2894 4.0891 32.7554 15.4275 8.9216 45.7481 3.3245 17.1937 17.0491 134.6299 74.8989 7.4279 5.6800 1.9727 1.7425 1.4561 0.4628 2.1401 12.1226
temp: 298.150 k
press: 1.00000 atm
elementType: 17 17 17 17 17 6 6 6 6 6 6 6 6 6 6 1 1 1 1 1 1 1
symmnumber: 1
zpe: 365432.6 jmol-1
zpe.correction: 0.139186 hartree
zpe.thermalcorrener: 0.154697 hartree
zpe.thermalcorrenthalpy: 0.155642 hartree
zpe.thermalcorrgfe: 0.093404 hartree
zpe.sumelectzpe: -2684.447791 hartree
zpe.sumelectthermal: -2684.432280 hartree
zpe.sumelectthermalent: -2684.431335 hartree
zpe.sumelectthermalfe: -2684.493573 hartree
dipole: -0.4497 -0.3112 2.4863
dipole: 2.5457
quadrupole: -129.3711 -122.7836 -121.1467
quadrupole: 0.0342 -6.2185 -2.0549
quadrupole: -4.9373 1.6502 3.2871 0.0342 -6.2185 -2.0549
hfenergy: -2684.586977 hartree
pointgroup: C01 [X(C10H7Cl5)]
dipole: 0.1919109 -0.3393235 -0.9225897 debye
dipolederiv: -0.6239174 -0.3494785 0.0263099 -0.4099322 -0.4730583 0.0384008 -0.0085221 0.0230584 -0.1762809 -0.3110609 0.2252428 -0.0270826 0.2398803 -0.6092733 0.0718176 -0.087556 0.0628484 -0.1733633 -0.4385677 0.0803123 0.2567646 0.091822 -0.1621977 -0.0886768 0.2599399 -0.1025553 -0.4799836 -0.2079507 0.2059542 -0.0120538 0.2540097 -0.7341506 0.1298684 -0.0260856 0.1348755 -0.0966953 -0.4143616 -0.2476424 0.2146311 -0.2977916 -0.396638 0.2268931 0.2490532 0.2176863 -0.2283505 -0.1515392 0.0407328 0.0650674 0.0544235 -0.1168339 0.0119369 0.0129935 0.0021718 -0.0854767 0.3909511 -0.062821 -0.0453057 0.0789282 0.0420385 0.1292364 -0.0769332 0.0205205 -0.0966709 0.1708808 -0.0532789 -0.055523 -0.1303779 0.1624074 -0.0885175 -0.1450671 -0.0196319 0.0981172 1.3744085 0.0102541 -0.263756 0.0243415 1.2704491 -0.0254793 -0.129302 0.0230584 0.8917839 -0.3662055 -0.1047498 0.113222 -0.1038289 -0.1758698 0.0378041 0.1697514 0.0343677 -0.1745007 -0.2891855 0.1938186 0.003549 0.1909184 -0.3331914 0.0190955 -0.0382577 0.0073555 -0.1098698 0.3784884 -0.3251496 -0.0573587 -0.4420004 1.1362876 -0.2275408 -0.0121849 -0.253967 0.0460942 0.654992 0.3418668 -0.3735708 0.4325764 0.6271746 -0.3961238 -0.4585612 -0.3480026 0.2645158 -0.1190359 0.0692215 -0.0429061 0.064279 -0.125065 0.0398806 0.0533174 0.0100134 -0.3144303 -0.2401233 -0.0290245 0.0559046 -0.0359266 -0.4815502 0.1551911 0.0775595 0.1400139 -0.1618018 -0.0378738 -0.0157765 0.0237029 0.0386669 0.0827593 -0.053109 0.0555637 -0.0289909 0.0013347 0.1070271 0.0490211 -0.0587335 0.0125397 -0.0427605 -0.0004739 -0.0597853 0.0244473 0.0747336 0.097679 0.0574907 0.0089959 0.0472116 0.0165248 0.0353653 0.0017953 0.0218411 0.1299517 0.0664348 -0.0619954 0.0676087 -0.073066 0.0581785 0.0402469 0.0831437 0.0398534 0.1121966 -0.072235 0.0508981 0.0708492 0.0549443 0.0859724 -0.0249124 0.0185585 -0.001772 0.1648078 -0.020993 -0.101809 -0.0124729 -0.1200119 0.0602486 -0.0406483 0.0141052 -0.0129714 0.1599145 0.052188 0.0269127 0.0421579 0.0283941 0.1085478 0.0097451 0.0464738 0.0057794 0.1539736 unknown
polarizability: 186.9409268|-8.4298005|180.0782782|-29.6116788|-9.21622|102.2390814 unknown
InChI: InChI=1S/C10H7Cl5/c1-6(5-10(13,14)15)7-2-8(11)4-9(12)3-7/h2-4H,1,5H2
charge 0 multiplicity 1
22 atoms
Cl 4.250878 1.423265 0.350734
Cl 3.674732 -1.519092 0.736803
Cl 1.791405 0.555452 1.886749
Cl -2.707717 3.09862 -0.669327
Cl -3.681126 -1.974365 1.37492
C  2.106701 0.1685 -0.895415
C  0.917306 -0.786384 -0.990612
C  -0.427401 -0.322665 -0.528342
C  2.880621 0.142226 0.437254
C  -1.301904 -1.23024 0.130859
C  -0.86829 1.008288 -0.761425
C  -2.155905 1.39176 -0.348876
C  -2.580035 -0.799693 0.522137
C  1.091749 -2.031226 -1.516825
C  -3.043943 0.51168 0.298782
H  2.844943 -0.061535 -1.684048
H  1.792881 1.217284 -1.041293
H  -0.968537 -2.24556 0.360134
H  -0.235025 1.733925 -1.278519
H  2.075403 -2.379677 -1.847573
H  0.255316 -2.72752 -1.639856
H  -4.03845 0.831357 0.617137
