program: Gaussian 09
title: 000092588
version: EM64L-G09RevD.01
frameworkgroup: C1[X(C7H10O)]
method: RPBEPBE
basis: SDD
operation: Freq
keyword: #pfreq=noraman
keyword: PBEPBE/SDD
title: #p freq=noraman PBEPBE/SDD
converged: NO YES NO NO
title: Mulliken charges:
elementType: O C C C C C C C H H H H H H H H H H
charge: -0.301512 0.000633 -0.359061 -0.512186 -0.003025 -0.455217 -0.009908 -0.657319 0.243263 0.221619 0.218820 0.247898 0.234389 0.233659 0.233399 0.215782 0.224120 0.224646
chargesum: 0.00000
title: Mulliken charges with hydrogens summed into heavy atoms:
elementType: O C C C C C C C
charge: -0.301512 0.243896 0.081378 -0.029900 -0.003025 0.011841 -0.009908 0.007229
polarizability: 1.06016568e+02 -2.48007273e+00 6.55968063e+01 2.31834995e+00 2.13125234e+00 5.60936628e+01
1716.lowfreq: -3.1125 -0.0009 -0.0009 -0.0009 4.0615 12.2248 18.5043 53.1298 78.5215
frequency: 14.8499 53.0661 78.4655 150.7917 180.2242 250.6757 315.5813 341.3920 363.1584 416.3259 517.7486 712.2474 748.5648 778.3581 790.4997 867.1317 928.7138 964.0481 1017.3495 1058.5207 1062.6105 1083.9393 1105.1562 1124.9123 1162.2630 1200.9212 1239.9421 1252.7240 1302.7613 1317.1314 1388.0269 1390.3762 1454.0601 1463.7991 1472.6250 1482.9287 1484.7708 2279.7137 2975.7424 2981.6610 2991.0461 3020.4474 3031.2788 3066.0992 3090.5464 3098.6250 3101.2055 3173.5864
redmass: 2.0277 3.9950 3.5996 2.7413 1.9208 1.6775 4.0673 4.7613 2.5393 3.1226 5.1125 4.6614 4.7626 1.1739 3.8259 1.2280 2.4527 2.3099 1.2348 1.6946 1.9681 1.4725 1.2963 1.3601 2.4792 1.3244 1.4478 1.1449 1.5025 1.5358 1.2172 1.9636 1.0888 1.0744 1.0418 1.2040 1.0565 11.6970 1.0588 1.0589 1.0350 1.1006 1.1002 1.0530 1.1003 1.1013 1.0920 1.1189
irintensity: 0.7170 0.8064 2.0408 5.9482 6.7246 7.1791 17.1259 3.2046 0.1671 4.5377 1.2577 10.6914 8.9659 6.6367 43.6452 2.6116 12.3009 0.5926 0.3496 1.9867 7.3771 0.6768 5.4523 4.8614 1.4901 6.5884 1.3894 0.3934 7.7213 14.1798 10.9942 8.0275 10.3002 6.5798 12.4120 4.4978 9.2477 0.9577 33.9307 24.3666 34.1878 11.2670 8.5789 26.0359 45.7088 34.9428 21.4353 31.0666
temp: 298.150 k
press: 1.00000 atm
elementType: 8 6 6 6 6 6 6 6 1 1 1 1 1 1 1 1 1 1
symmnumber: 1
zpe: 390859.5 jmol-1
zpe.correction: 0.148871 hartree
zpe.thermalcorrener: 0.158378 hartree
zpe.thermalcorrenthalpy: 0.159323 hartree
zpe.thermalcorrgfe: 0.112265 hartree
zpe.sumelectzpe: -347.234832 hartree
zpe.sumelectthermal: -347.225324 hartree
zpe.sumelectthermalent: -347.224380 hartree
zpe.sumelectthermalfe: -347.271438 hartree
dipole: -2.6726 0.9561 0.1610
dipole: 2.8430
quadrupole: -54.5104 -46.1357 -46.6506
quadrupole: 1.5826 1.3016 0.4413
quadrupole: -5.4115 2.9632 2.4483 1.5826 1.3016 0.4413
hfenergy: -347.3837028 hartree
pointgroup: C01 [X(C7H10O1)]
dipole: 1.0440975 0.3969807 -0.0581143 debye
dipolederiv: -0.8274216 -0.0691562 0.0514571 -0.0375905 -0.3886241 -0.0337652 0.057926 -0.0287701 -0.3189269 0.4545751 -0.1558758 0.0028029 -0.1778168 0.250374 0.0752222 -0.153018 0.0579384 0.2992956 0.1150552 0.1148081 -0.1071682 -0.0265603 0.2176727 0.0418207 -0.0249864 0.071277 0.2336516 0.1581558 0.0515204 0.0214262 0.0839219 0.1126939 -0.0589871 0.0175766 -0.0316388 0.1264385 -0.1235912 -0.0179336 0.0078104 0.1182089 -0.218594 -0.0097825 0.0633157 -0.025384 -0.1686483 0.2161419 -0.0118689 0.0042936 -0.0311619 0.1117971 -0.005523 0.0037214 -0.0116587 0.1936494 0.0056942 0.0841285 0.0089784 -0.0276703 -0.1936454 -0.0042344 -0.0017036 -0.0019728 -0.1506206 -0.0122431 -0.0278406 -0.0039015 0.0603271 0.0203418 -0.0033888 -0.000183 -0.0036381 0.0792039 0.0348451 0.0422816 -0.0524767 0.0567037 0.045317 -0.0414913 -0.0345668 -0.055528 -0.1088495 0.0895231 0.0167895 0.0411035 0.0393841 -0.1371271 -0.0341958 0.0291991 -0.0633317 0.0423371 0.1126735 -0.0307718 0.0670348 -0.0147627 0.0329071 -0.0191395 0.0579474 0.0304105 -0.1207602 -0.0221558 -0.0411962 0.0167104 -0.0330113 -0.0609822 0.0784576 0.0581428 0.0930112 0.0654243 -0.0368084 -0.021123 -0.0606835 0.012912 0.1033294 -0.0003986 -0.0666957 -0.0487889 -0.0722743 -0.0495726 0.0170531 -0.069896 0.0096752 0.0040171 0.0814579 -0.1116846 0.1007793 -0.0245041 -0.0542776 0.01505 0.0696036 -0.0034758 0.0341941 -0.0740065 0.1071999 -0.0909868 -0.044204 -0.2235917 -0.0772922 -0.0120452 -0.0799633 0.0424083 -0.0059322 -0.0117271 -0.006463 0.1062739 0.0788263 0.0504155 0.1003226 0.0215259 0.0253175 -0.0617288 0.0677993 -0.0960168 -0.0803487 0.0841717 0.0610117 -0.0853727 0.0293543 -0.0013973 0.0756154 -0.058263 0.1107614 -0.0571377 unknown
polarizability: 105.8755947|3.2955368|65.7086681|2.6198062|-2.0741124|56.1227744 unknown
InChI: InChI=1S/C7H10O/c1-2-3-4-5-7-6-8-7/h7H,2,5-6H2,1H3
charge 0 multiplicity 1
18 atoms
O  -3.317112 0.086378 0.130498
C  -1.84269 0.091794 0.467375
C  -2.404558 1.182572 -0.386083
C  -1.029624 -1.051715 -0.136967
C  0.42126 -0.782932 -0.101394
C  3.080156 -0.259604 -0.011568
C  1.634003 -0.551137 -0.061336
C  3.391393 1.256867 0.112159
H  -1.636603 0.312301 1.523325
H  -2.586683 2.17505 0.043477
H  -2.224504 1.15511 -1.468394
H  -1.258848 -1.982792 0.417723
H  -1.370502 -1.21508 -1.177922
H  3.534825 -0.800271 0.842182
H  3.563915 -0.659869 -0.924502
H  4.483292 1.422578 0.144149
H  2.948542 1.672822 1.033523
H  2.978938 1.812926 -0.747345
