program: Gaussian 09
title: 000092597
version: EM64L-G09RevD.01
frameworkgroup: C1[X(C10H8ClN)]
method: RPBEPBE
basis: SDD
operation: Freq
keyword: #p
keyword: freq=noraman
keyword: PBEPBE/SDD
title: #p freq=noraman PBEPBE/SDD
converged: NO NO NO NO
title: Mulliken charges:
elementType: Cl N C C C C C C C C C C H H H H H H H H
charge: -0.063342 -0.022690 0.263236 0.464539 -0.022371 -0.370018 -0.257883 -0.795410 -0.302168 -0.251628 -0.395245 -0.223245 0.243990 0.242240 0.253303 0.242284 0.264504 0.230547 0.264694 0.234663
chargesum: 0.00000
title: Mulliken charges with hydrogens summed into heavy atoms:
elementType: Cl N C C C C C C C C C C
charge: -0.063342 -0.022690 0.263236 0.464539 -0.022371 -0.126029 -0.257883 -0.057583 -0.037664 -0.021081 -0.130551 0.011418
polarizability: 1.94495103e+02 5.72080120e+00 1.27088583e+02 8.31969351e-03 -1.01729791e-03 5.19192754e+01
1716.lowfreq: 0.0018 0.0025 0.0026 8.6513 8.7580 21.3690 86.6490 129.8858 152.6959
frequency: 86.6018 129.8800 152.6640 217.8279 221.4815 291.5701 295.3630 335.2686 427.1954 460.3193 497.3440 504.3708 558.0531 563.2927 594.5969 645.9370 705.8740 772.1559 791.8387 828.2866 832.6666 880.3145 912.7064 969.6805 998.9173 1000.7825 1022.4777 1038.9721 1066.9276 1124.7016 1172.5780 1185.0296 1221.9059 1264.3471 1316.8343 1368.1232 1386.7275 1400.8649 1419.4932 1445.2881 1465.4046 1478.6913 1499.6605 1543.4659 1575.1564 1618.6972 2985.7810 3060.2445 3117.8464 3130.3698 3137.8130 3144.5346 3159.0453 3172.7980
redmass: 6.8781 2.9679 1.0654 8.2645 3.8121 6.0092 3.1554 12.9264 3.1355 4.3231 6.1209 3.7003 3.5912 6.5871 7.8232 3.4851 5.1377 1.3268 3.1859 4.8249 5.3737 1.6098 1.4213 1.3630 1.3254 2.1542 2.4774 1.5365 2.6673 1.8681 1.2264 2.3552 2.1715 1.6860 4.4474 1.9918 3.2063 1.2621 3.6183 2.7947 1.1546 1.0451 3.4833 6.3983 6.6829 6.2887 1.0392 1.0972 1.0968 1.0855 1.0924 1.0896 1.0959 1.0994
irintensity: 0.0897 0.0899 0.9951 0.1466 3.2027 0.3204 2.1501 7.0426 9.4992 5.4166 0.1180 0.0013 1.4998 0.7437 15.2443 1.5936 1.2778 88.0566 3.2739 31.1253 2.5360 0.0794 13.0121 2.6845 0.1452 74.7477 0.3974 3.1649 0.0622 28.8472 1.4415 10.9471 3.3013 2.5241 3.1573 14.0615 16.6669 14.2408 5.8373 7.6627 15.7514 16.5897 19.0664 2.7930 23.6538 1.0285 13.4966 13.1181 7.3638 1.3129 7.7788 9.4031 21.6863 18.7143
temp: 298.150 k
press: 1.00000 atm
elementType: 17 7 6 6 6 6 6 6 6 6 6 6 1 1 1 1 1 1 1 1
symmnumber: 1
zpe: 395956.6 jmol-1
zpe.correction: 0.150812 hartree
zpe.thermalcorrener: 0.160568 hartree
zpe.thermalcorrenthalpy: 0.161512 hartree
zpe.thermalcorrgfe: 0.115452 hartree
zpe.sumelectzpe: -899.850311 hartree
zpe.sumelectthermal: -899.840556 hartree
zpe.sumelectthermalent: -899.839611 hartree
zpe.sumelectthermalfe: -899.885671 hartree
dipole: 1.6435 2.7387 0.0003
dipole: 3.1940
quadrupole: -71.2396 -73.1115 -80.1211
quadrupole: 1.3403 0.0005 0.0003
quadrupole: 3.5845 1.7126 -5.2970 1.3403 0.0005 0.0003
hfenergy: -900.0011234 hartree
pointgroup: C01 [X(C10H8Cl1N1)]
dipole: -0.6589107 -1.0700223 0.0001108 debye
dipolederiv: -0.970887 0.0414002 0.0000522 0.1414867 -0.1262534 -0.0000112 0.0000557 -0.0000124 -0.0658203 -0.3291037 0.0716358 0.0000071 0.1776151 -0.323478 -0.0000035 0.0000167 -0.0000099 -0.2387638 0.0434121 0.0810283 -0.0000135 0.1508339 -0.2109637 -0.0000287 -0.0000225 -0.0000066 0.032855 -0.1336735 -0.0412675 0.0000219 -0.117804 0.3676336 -0.000025 0.0000484 -0.0001349 0.0035429 0.2429003 0.1065864 -0.000003 -0.0925974 -0.0240267 0.0000101 -0.0000171 0.0000021 0.0504463 -0.1296851 -0.010986 0.0000052 0.0154622 0.0628628 -0.0000265 0.0000169 -0.0000011 -0.1640546 1.2580039 -0.1084491 -0.0000512 -0.2618461 -0.2368049 0.0000078 -0.0000569 -0.0000048 -0.0326385 0.0027431 -0.0140604 -0.0000035 0.1029603 -0.1866132 0.0000411 -0.0000366 0.0002278 0.0523877 -0.0373701 -0.030832 -0.000008 -0.0822962 0.1199529 0.0000097 -0.0000119 0.0000029 -0.138099 -0.0224268 0.088126 -0.0000234 0.0991624 0.1227488 0.0000046 -0.0000193 -0.0000178 -0.1452112 -0.1009692 -0.0215209 0.0000016 0.0858525 0.3883881 0.0000024 0.0000117 0.0000301 -0.0179833 0.087251 -0.1054455 -0.0000237 -0.1240308 -0.0668151 0.0000061 -0.0000209 0.0000186 -0.1572428 0.083263 0.0636015 0.0000067 0.0119913 -0.0852734 0.0000036 -0.0000045 -0.0000041 0.1479528 0.0794389 -0.0426207 -0.0896652 -0.007139 0.0175165 -0.0593256 -0.0554214 -0.0859281 -0.0231985 -0.074903 0.0845868 0.000176 -0.0285736 0.1149682 0.0000266 0.0001309 -0.0000625 0.1152298 0.079684 -0.042368 0.0894719 -0.0069914 0.017494 0.0593148 0.0552858 0.0859088 -0.0234908 0.0876347 0.0101746 0.0000062 0.0681789 -0.0388079 -0.0000094 0.0000065 -0.0000073 0.1591149 -0.0303957 -0.1004277 0.000016 -0.112418 -0.0152272 0.0000085 0.0000194 0.0000087 0.1589191 -0.0154291 -0.0840236 0.0000035 -0.0707014 0.0243624 -0.0000004 -0.0000069 -0.0000048 0.1251962 -0.1194879 0.0548615 0.0000233 0.0508547 0.0783362 -0.0000049 0.000026 -0.0000048 0.1608582 unknown
polarizability: 194.6173245|4.9471342|126.966362|-0.0083075|0.0011125|51.9192754 unknown
InChI: InChI=1S/C10H8ClN/c1-7-8-4-2-3-5-10(8)12-6-9(7)11/h2-6H,1H3
charge 0 multiplicity 1
20 atoms
Cl 3.792586 -0.006088 -0.000242
N  0.237419 1.945695 0.00001
C  -0.314341 -0.487234 -0.00007
C  1.093766 -0.832166 -0.000193
C  -0.696245 0.912907 0.000023
C  -1.352173 -1.47656 0.000009
C  1.983251 0.24852 -0.000162
C  1.533256 -2.279435 -0.000243
C  -2.081813 1.270508 0.000139
C  -2.698213 -1.100373 0.000137
C  1.535312 1.608603 -0.000075
C  -3.06822 0.281739 0.000195
H  -1.085446 -2.538511 -0.000006
H  1.144864 -2.809306 -0.889943
H  2.63017 -2.363915 -0.001097
H  1.146368 -2.808861 0.890398
H  -2.325345 2.337322 0.000184
H  -3.479049 -1.869141 0.000206
H  2.270997 2.420808 -0.000057
H  -4.127745 0.560191 0.000287
