program: Gaussian 09
title: 000092610
version: EM64L-G09RevD.01
frameworkgroup: C1[X(C14H22O)]
method: RPBEPBE
basis: SDD
operation: Freq
keyword: #pfreq=noraman
keyword: PBEPBE/SDD
title: #p freq=noraman PBEPBE/SDD
converged: YES YES NO NO
title: Mulliken charges:
elementType: O C C C C C C C C C C C C C C H H H H H H H H H H H H H H H H H H H H H H
charge: -0.223797 0.356142 -0.462530 -0.542426 -0.477456 0.274799 -0.755842 -0.757728 -0.329285 0.103530 -0.525013 -0.136772 -0.737151 -0.039637 -0.599865 0.209505 0.209618 0.228103 0.247651 0.232064 0.219112 0.207948 0.214909 0.232830 0.211487 0.216597 0.211725 0.211680 0.231122 0.208069 0.253409 0.202686 0.215475 0.233437 0.214609 0.209723 0.231273
chargesum: 0.00000
title: Mulliken charges with hydrogens summed into heavy atoms:
elementType: O C C C C C C C C C C C C C C
charge: -0.223797 0.356142 -0.043407 -0.066673 -0.026281 0.274799 -0.100156 -0.117918 -0.117605 0.103530 -0.085822 0.116637 -0.085554 0.174972 -0.158869
polarizability: 1.70050852e+02 -3.18604601e+00 1.55246113e+02 -6.89507753e+00 7.92031550e+00 1.27078067e+02
1716.lowfreq: -11.5015 -0.0006 0.0006 0.0006 3.4512 7.9284 17.8540 28.4826 63.7963
frequency: 16.7559 27.2292 63.6492 74.9996 79.2473 124.6220 167.4526 197.0938 209.7354 227.6609 234.0179 240.2268 257.8807 280.4903 307.5060 319.6918 327.1801 331.0098 387.4105 404.8605 417.3502 449.8894 484.8599 505.6957 550.9911 588.0767 671.0097 703.4423 727.7220 788.1260 812.6054 852.0498 870.2961 884.0839 889.2646 910.3963 935.4976 936.3012 944.3510 948.5746 967.5191 980.2300 995.1059 999.8635 1004.7033 1025.7959 1074.2486 1081.0382 1106.6595 1129.0996 1143.6036 1151.3118 1169.0900 1209.0939 1217.7819 1225.5879 1267.1731 1272.1771 1279.7747 1284.4309 1307.1422 1318.4319 1325.7196 1341.0075 1346.2500 1374.9862 1377.2018 1387.4311 1395.5396 1426.1523 1435.8135 1444.3650 1448.4782 1457.2705 1468.4667 1473.3188 1473.4609 1479.6738 1481.1865 1491.5377 1559.7126 1645.4747 1656.0565 2949.6903 2963.8957 2967.2481 2968.9898 2969.1202 2969.3286 2975.6683 3001.1753 3020.1043 3030.6150 3034.9693 3045.2995 3051.9527 3060.1009 3061.4174 3064.6488 3066.4181 3072.7350 3078.6131 3091.2420 3116.5149 3195.9331
redmass: 3.8294 3.6238 3.2089 3.4305 2.7394 3.2959 2.5703 1.6218 1.7026 2.3343 1.2051 1.3476 1.5464 1.8880 2.0455 2.2531 2.4270 2.4961 2.5554 1.9375 2.5493 3.5025 3.4382 3.2695 3.7149 2.3429 2.0997 3.0527 2.1192 2.3105 2.0239 1.7024 2.1759 2.6413 1.9099 1.9606 1.4871 1.7110 1.3387 1.7125 2.0810 1.3380 1.7702 1.1389 1.6459 1.6709 2.8686 1.5926 1.7594 1.5498 1.7202 1.5688 1.6099 1.6614 2.0807 1.6928 1.7014 1.7442 1.6656 1.2752 1.5237 1.3559 1.4505 1.6640 1.5890 1.6709 1.3732 1.2274 1.2173 1.1684 1.1164 1.0965 1.0731 1.0728 1.0568 1.0673 1.0499 1.0580 1.0548 1.0608 9.4288 6.3760 4.8368 1.0646 1.0356 1.0554 1.0470 1.0597 1.0451 1.0556 1.0905 1.0847 1.0982 1.0987 1.0936 1.0877 1.0996 1.0994 1.0949 1.0986 1.0988 1.0992 1.0680 1.0895 1.1149
irintensity: 0.4511 0.4386 0.7409 1.6256 0.4049 1.9268 0.0937 1.6780 2.7801 0.6537 0.2247 0.8715 0.9114 1.3956 0.2092 0.1997 2.7086 0.6693 0.3246 1.1924 1.6176 0.8066 0.0351 0.9335 2.0978 7.5744 30.1771 0.4957 8.5922 9.8486 3.2183 7.5412 0.3754 8.4916 0.7634 4.6960 0.9062 2.8185 90.6870 3.9494 6.4008 9.6702 5.0690 19.7433 6.6288 3.8234 4.9261 0.7576 10.3618 5.0254 17.8371 3.8962 22.5861 11.3380 45.7140 32.5191 14.4122 21.4440 35.5227 6.1118 1.7113 2.6257 12.7386 7.4357 6.9794 12.7754 27.5961 7.6141 13.5532 18.3592 3.0657 10.3639 18.3742 3.6368 8.9662 10.7945 12.2424 8.9288 9.1900 6.9919 116.6158 48.0689 11.8399 20.9740 29.9072 15.6222 34.3669 27.6615 40.3127 29.9285 38.9715 2.4620 10.0477 30.4990 2.6731 6.8749 4.7798 40.5220 70.1645 69.0069 44.3974 39.6305 7.5165 24.9818 23.8590
temp: 298.150 k
press: 1.00000 atm
elementType: 8 6 6 6 6 6 6 6 6 6 6 6 6 6 6 1 1 1 1 1 1 1 1 1 1 1 1 1 1 1 1 1 1 1 1 1 1
symmnumber: 1
zpe: 846979.7 jmol-1
zpe.correction: 0.322598 hartree
zpe.thermalcorrener: 0.339627 hartree
zpe.thermalcorrenthalpy: 0.340571 hartree
zpe.thermalcorrgfe: 0.277111 hartree
zpe.sumelectzpe: -620.705577 hartree
zpe.sumelectthermal: -620.688548 hartree
zpe.sumelectthermalent: -620.687604 hartree
zpe.sumelectthermalfe: -620.751064 hartree
dipole: -1.5069 2.7797 1.7372
dipole: 3.6077
quadrupole: -90.9485 -90.9589 -94.7110
quadrupole: 2.4829 0.6133 -1.4516
quadrupole: 1.2576 1.2473 -2.5049 2.4829 0.6133 -1.4516
hfenergy: -621.0281744 hartree
pointgroup: C01 [X(C14H22O1)]
dipole: -0.6647123 1.0490098 0.6872983 debye
polarizability: 170.6095209|-2.3887335|154.7087989|-6.5650973|7.9021972|127.0567118 unknown
InChI: InChI=1S/C14H22O/c1-5-11(2)9-13(15)12-7-6-8-14(3,4)10-12/h5,7,11H,1,6,8-10H2,2-4H3
charge 0 multiplicity 1
37 atoms
O  1.109172 -0.920287 -1.398822
C  -2.951554 -0.613296 0.025182
C  -3.374885 0.876566 0.174873
C  -1.592999 -0.669418 -0.72986
C  -2.334588 1.711762 0.95442
C  -0.558278 0.327665 -0.22354
C  -2.813261 -1.285074 1.418144
C  -4.022858 -1.369955 -0.798124
C  -0.912551 1.407912 0.541488
C  0.856073 0.07252 -0.646281
C  1.999661 1.015048 -0.234351
C  3.359464 0.272418 -0.073823
C  4.533657 1.282014 -0.099635
C  3.374366 -0.533009 1.215363
C  3.367129 -1.886669 1.295309
H  -4.360412 0.939495 0.676719
H  -3.499661 1.308982 -0.838408
H  -1.757243 -0.488051 -1.812418
H  -1.162265 -1.687007 -0.674246
H  -2.430235 1.528366 2.046832
H  -2.532923 2.795172 0.82531
H  -3.747132 -1.177162 2.002377
H  -2.605705 -2.365624 1.305767
H  -1.986248 -0.848975 2.006648
H  -4.192687 -0.881271 -1.776542
H  -3.709394 -2.413409 -0.99097
H  -4.989471 -1.400402 -0.260003
H  -0.14343 2.105136 0.89887
H  2.098191 1.774613 -1.039085
H  1.762657 1.56655 0.693142
H  3.452444 -0.425082 -0.926671
H  4.452177 2.014434 0.727297
H  4.549908 1.846011 -1.051273
H  5.501402 0.760558 0.007943
H  3.392371 0.063409 2.144223
H  3.378652 -2.407557 2.259945
H  3.338554 -2.508583 0.392499
