program: Gaussian 09
title: 000092607
version: EM64L-G09RevD.01
frameworkgroup: C1[X(C14H22O)]
method: RPBEPBE
basis: SDD
operation: Freq
keyword: #pfreq=noraman
keyword: PBEPBE/SDD
title: #p freq=noraman PBEPBE/SDD
converged: YES YES NO NO
title: Mulliken charges:
elementType: O C C C C C C C C C C C C C C H H H H H H H H H H H H H H H H H H H H H H
charge: -0.222663 0.356053 -0.493771 -0.556663 -0.096768 0.311722 -0.761205 -0.761863 -0.349796 -0.723049 0.030237 -0.500723 -0.465386 -0.034183 -0.599277 0.210419 0.199406 0.221755 0.213393 0.229964 0.213038 0.208890 0.235306 0.212562 0.211758 0.216949 0.265498 0.219282 0.216760 0.219202 0.231186 0.247467 0.219909 0.233753 0.207118 0.213480 0.220241
chargesum: 0.00000
title: Mulliken charges with hydrogens summed into heavy atoms:
elementType: O C C C C C C C C C C C C C C
charge: -0.222663 0.356053 -0.083946 -0.121516 0.133196 0.311722 -0.103971 -0.120594 -0.084299 -0.067805 0.030237 -0.022071 -0.011724 0.172935 -0.165555
polarizability: 1.99797169e+02 -1.29738726e+01 1.47954947e+02 7.84581848e+00 -2.13494555e+00 1.17028545e+02
1716.lowfreq: -14.5605 -4.0773 -0.4588 -0.0006 -0.0003 0.0001 23.8060 47.5990 58.9635
frequency: 23.6620 47.5368 58.9580 68.2815 94.8571 119.9881 122.2061 157.7312 201.9304 217.1541 224.1397 236.2823 239.3103 265.7336 304.9807 314.3948 332.4631 359.2514 370.3566 405.4662 427.7578 454.9630 488.8236 498.2942 538.4505 562.6199 632.3703 688.0070 771.1492 775.9697 837.8774 846.4461 885.1773 910.8157 912.0462 915.9312 931.9652 934.0265 940.6800 957.1624 973.8402 981.4039 1001.2559 1005.5222 1014.7432 1045.3294 1056.9011 1069.9975 1096.9697 1130.3388 1145.6712 1156.1676 1186.2406 1193.5134 1208.4375 1255.7792 1263.6563 1270.5937 1275.3901 1279.5190 1293.3756 1297.5186 1323.6592 1333.7226 1340.1154 1355.1129 1374.2926 1386.4287 1393.2982 1424.3479 1429.2716 1449.7861 1457.1732 1459.3532 1466.8586 1472.3189 1474.4195 1478.6126 1479.4167 1489.2571 1561.4277 1646.4839 1659.2610 2924.4059 2947.4177 2954.1261 2960.2855 2963.5570 2972.2101 2975.6364 2990.0486 3005.2702 3011.8583 3022.2597 3051.8766 3057.0728 3061.3105 3064.6461 3069.7383 3074.4122 3075.8114 3076.4031 3090.3493 3099.3803 3194.2420
redmass: 4.4123 2.2492 3.2350 3.4800 2.5212 2.6809 2.5882 2.3948 2.5634 1.0976 1.3182 1.5121 1.8566 1.6992 2.7927 2.5679 3.3531 3.1843 2.7066 2.1390 2.1326 2.6639 3.2688 2.9108 2.5631 2.1062 1.5918 4.6732 3.2748 1.5288 2.9421 2.3389 1.8823 1.9253 1.4866 1.8623 1.6678 1.4399 1.3488 1.7397 1.7106 1.5953 1.3959 1.2254 2.1410 1.7923 2.2035 2.8793 1.4863 1.5703 1.3977 1.8198 1.9217 1.7929 2.1958 1.3526 1.5187 1.6146 1.5089 1.3858 1.2782 1.6418 1.6325 1.6786 1.6822 2.1466 1.2087 1.2137 1.2146 1.0967 1.1838 1.0882 1.0712 1.0982 1.0525 1.0599 1.0527 1.0596 1.0581 1.0585 8.2710 8.0161 4.7451 1.0803 1.0622 1.0639 1.0535 1.0407 1.0372 1.0352 1.0628 1.0959 1.0920 1.1015 1.0939 1.0996 1.0994 1.0987 1.0864 1.0999 1.1001 1.0986 1.0717 1.0897 1.1145
irintensity: 0.9870 0.0691 1.5522 2.3906 0.4747 0.1136 0.4856 0.1517 3.2523 0.2808 0.3037 0.8002 0.0491 0.3335 2.2751 1.1392 2.3773 3.8321 1.2363 0.5749 3.9671 0.7745 0.7444 6.7542 2.1292 0.7381 25.1211 14.7353 0.8071 13.2255 0.5224 6.7049 4.4720 10.7205 8.6280 3.1159 6.4839 2.4744 74.5668 6.2479 7.5602 6.9399 3.5904 13.3336 4.9421 18.2755 6.9636 5.7105 1.7650 2.7904 5.9446 61.9639 5.5519 28.9515 23.1070 75.7007 3.4353 0.4506 6.2826 23.2175 8.2731 2.5511 2.7480 8.3120 37.4059 19.7301 23.6205 6.5938 16.5151 10.6518 5.1073 4.1270 0.4204 17.1943 2.1337 0.7245 17.5872 10.0526 8.3844 11.0807 159.4610 60.7662 23.8490 12.8795 39.0209 16.0014 19.5075 61.5002 28.8134 43.5057 11.9569 19.0906 11.0706 33.8938 2.9303 12.5159 31.7300 62.1445 48.2776 36.6016 30.6096 51.1993 7.0835 4.2828 31.7209
temp: 298.150 k
press: 1.00000 atm
elementType: 8 6 6 6 6 6 6 6 6 6 6 6 6 6 6 1 1 1 1 1 1 1 1 1 1 1 1 1 1 1 1 1 1 1 1 1 1
symmnumber: 1
zpe: 845606.2 jmol-1
zpe.correction: 0.322074 hartree
zpe.thermalcorrener: 0.339277 hartree
zpe.thermalcorrenthalpy: 0.340221 hartree
zpe.thermalcorrgfe: 0.276734 hartree
zpe.sumelectzpe: -620.705853 hartree
zpe.sumelectthermal: -620.688651 hartree
zpe.sumelectthermalent: -620.687707 hartree
zpe.sumelectthermalfe: -620.751194 hartree
dipole: 2.5370 2.6484 -0.4334
dipole: 3.6930
quadrupole: -92.2025 -98.8723 -92.3604
quadrupole: -6.6279 1.2366 2.7856
quadrupole: 2.2759 -4.3939 2.1180 -6.6279 1.2366 2.7856
hfenergy: -621.0279277 hartree
pointgroup: C01 [X(C14H22O1)]
dipole: -1.0296448 -1.0038261 -0.2078788 debye
polarizability: 199.1181767|-14.6375926|148.8122939|-6.4803406|2.693127|116.8501896 unknown
InChI: InChI=1S/C14H22O/c1-5-6-7-13(15)12-8-11(2)9-14(3,4)10-12/h5,8,11H,1,6-7,9-10H2,2-4H3
charge 0 multiplicity 1
37 atoms
O  1.442856 2.088234 0.496063
C  -2.179666 -1.296313 -0.112364
C  -3.04256 -0.143799 -0.70094
C  -0.675147 -0.952374 -0.331025
C  -2.765362 1.22733 -0.037646
C  -0.321575 0.48848 0.024302
C  -2.463425 -1.476116 1.403802
C  -2.513545 -2.616376 -0.850522
C  -1.282984 1.454161 0.153911
C  -3.409275 2.391126 -0.835827
C  1.116526 0.893308 0.220113
C  2.192845 -0.191111 0.082134
C  3.6328 0.368586 0.125206
C  4.668723 -0.733246 0.171347
C  5.665531 -0.916407 -0.73127
H  -4.117643 -0.394603 -0.60354
H  -2.830086 -0.059309 -1.787341
H  -0.410127 -1.144037 -1.393057
H  -0.060422 -1.657832 0.263081
H  -3.232004 1.232217 0.973711
H  -3.546345 -1.610587 1.587621
H  -1.94175 -2.371312 1.792042
H  -2.119775 -0.60722 1.993087
H  -2.380847 -2.507185 -1.944016
H  -1.858107 -3.440563 -0.509314
H  -3.561052 -2.919573 -0.664075
H  -0.947862 2.469139 0.414547
H  -2.975621 2.456885 -1.850773
H  -4.499131 2.235334 -0.938782
H  -3.24777 3.362302 -0.332859
H  2.045568 -0.926987 0.902656
H  2.025804 -0.76282 -0.852407
H  3.802688 1.023383 -0.748678
H  3.72151 1.020049 1.016935
H  4.589747 -1.429605 1.023083
H  6.390202 -1.732673 -0.632424
H  5.786881 -0.249184 -1.593979
