program: Gaussian 09
title: 000092590
version: EM64L-G09RevD.01
frameworkgroup: C1[X(C6H3Cl3O3)]
method: RPBEPBE
basis: SDD
operation: Freq
keyword: #p
keyword: freq=noraman
keyword: PBEPBE/SDD
title: #p freq=noraman PBEPBE/SDD
converged: NO NO NO YES
title: Mulliken charges:
elementType: Cl Cl Cl O O O C C C C C C H H H
charge: 0.009458 0.009549 0.009440 -0.389462 -0.389380 -0.389469 0.588001 0.587411 0.587748 -0.574787 -0.575052 -0.574819 0.367129 0.367106 0.367128
chargesum: 0.00000
title: Mulliken charges with hydrogens summed into heavy atoms:
elementType: Cl Cl Cl O O O C C C C C C
charge: 0.009458 0.009549 0.009440 -0.022333 -0.022274 -0.022342 0.588001 0.587411 0.587748 -0.574787 -0.575052 -0.574819
polarizability: 1.39533312e+02 6.29524527e-04 1.39524147e+02 7.84131066e-03 -4.30711271e-03 3.79240711e+01
1716.lowfreq: -0.0022 0.0014 0.0019 5.7739 7.9998 8.0538 98.5485 99.2090 113.2010
frequency: 98.5475 99.2071 113.2004 184.1977 184.9504 202.6009 256.8537 300.1953 300.7663 316.5204 317.0091 348.4100 393.2536 393.5001 455.7521 459.6209 466.2405 578.7501 634.4024 634.6907 674.3235 702.7375 703.5059 808.1845 1038.1854 1038.5341 1079.0319 1208.4819 1209.3399 1216.5698 1364.8977 1442.6854 1442.8839 1443.5921 1607.7411 1607.8560 3482.8519 3484.0461 3485.5387
redmass: 11.2381 11.2647 18.4363 25.8421 25.9309 7.8877 9.0928 7.9960 8.0419 8.5395 8.6630 31.7284 8.7959 8.8041 1.1230 1.1235 1.0941 10.3013 10.5597 10.5719 5.5332 9.6230 9.6202 11.3694 9.3131 9.3199 11.0999 1.4191 1.4177 1.5663 11.8121 5.7713 5.4141 3.9322 7.6870 7.7304 1.0649 1.0649 1.0650
irintensity: 0.0000 0.0001 0.4584 0.2664 0.2551 3.2806 0.0013 13.5389 13.3773 0.0043 0.0001 0.0008 8.0496 8.0905 23.1696 0.0032 413.8987 0.0000 0.0008 0.0006 0.0028 83.8245 83.9816 15.7002 59.8946 60.0243 0.0059 349.4330 350.3767 0.5254 0.0120 141.4301 125.0378 21.5449 46.7355 46.9730 87.0965 74.3095 49.8028
temp: 298.150 k
press: 1.00000 atm
elementType: 17 17 17 8 8 8 6 6 6 6 6 6 1 1 1
symmnumber: 1
zpe: 214009.9 jmol-1
zpe.correction: 0.081512 hartree
zpe.thermalcorrener: 0.093180 hartree
zpe.thermalcorrenthalpy: 0.094125 hartree
zpe.thermalcorrgfe: 0.043402 hartree
zpe.sumelectzpe: -1835.387456 hartree
zpe.sumelectthermal: -1835.375787 hartree
zpe.sumelectthermalent: -1835.374843 hartree
zpe.sumelectthermalfe: -1835.425566 hartree
dipole: 0.0006 -0.0012 0.0002
dipole: 0.0013
quadrupole: -86.4919 -86.4872 -90.6089
quadrupole: 0.0003 -0.0005 0.0003
quadrupole: 1.3707 1.3755 -2.7462 0.0003 -0.0005 0.0003
hfenergy: -1835.4689678 hartree
pointgroup: C01 [X(C6H3Cl3O3)]
dipole: 0.0004513 0.0002417 0.0000945 debye
dipolederiv: -0.2103308 0.1741934 0.0000173 0.2245897 -0.5657931 -0.0000464 0.0000255 -0.0000517 0.0017599 -0.3044108 -0.2790642 -0.0000283 -0.2280892 -0.4716824 -0.0000401 -0.0000166 -0.000023 0.0017545 -0.6495372 0.0291654 -0.0000312 0.0799914 -0.1265857 -0.0000091 -0.0000092 -0.0000123 0.0013364 -1.3258776 -0.0604655 -0.0000496 -0.0023208 -0.1386041 0.0000136 -0.0000697 0.0000103 -0.3798241 -0.4076065 -0.5270655 0.000008 -0.4689985 -1.0561922 -0.0000771 -0.0000155 -0.0001016 -0.3797519 -0.4628265 0.5010323 0.000039 0.5587949 -1.0012269 -0.0000332 0.0000363 -0.0000325 -0.3798477 1.1518282 0.0367246 0.0000603 -0.0114476 0.0984334 -0.0000055 0.0000929 0.0000059 0.2288964 0.3507338 0.4735563 0.0000187 0.425439 0.899176 0.0000384 0.0000284 0.000055 0.2285356 0.3726625 -0.4381933 -0.0000268 -0.4862172 0.8769438 0.000051 -0.0000142 0.0000603 0.2286329 -0.2147389 -0.503126 -0.0000546 -0.5200631 0.5505587 0.0000726 -0.0000618 0.0000693 -0.224282 -0.0832851 0.5953324 0.0000358 0.5779617 0.4196647 0.0000568 0.0000075 0.0000169 -0.224066 0.8019353 -0.0671707 0.0000483 -0.0841969 -0.465919 -0.0000213 0.0000196 -0.000011 -0.2240904 0.4555257 -0.0051583 0.0000036 -0.0488208 0.198798 -0.000013 0.0000045 -0.0000113 0.373456 0.2862695 0.1461246 -0.0000305 0.1027615 0.3677558 0.0000128 -0.0000168 0.0000255 0.3736591 0.2396583 -0.0758853 -0.00001 -0.1193841 0.414673 0.0000007 -0.0000111 0.0000001 0.3738313 unknown
polarizability: 139.5241815|-0.0008457|139.5332775|0.0041203|0.0079411|37.9240711 unknown
InChI: InChI=1S/C6H3Cl3O3/c7-1-4(10)2(8)6(12)3(9)5(1)11/h10-12H
charge 0 multiplicity 1
15 atoms
Cl 1.439364 -2.878134 -0.000322
Cl 1.772911 2.68585 0.000167
Cl -3.212122 0.192743 -0.00026
O  2.803102 -0.19793 0.000032
O  -1.572964 -2.329003 -0.000318
O  -1.230535 2.526525 0.000071
C  1.421473 -0.073463 -0.000045
C  -0.774536 -1.194462 -0.000214
C  -0.647092 1.267889 -0.000021
C  0.640798 -1.24922 -0.000172
C  0.76146 1.17984 0.000053
C  -1.402296 0.069552 -0.00018
H  3.223631 0.704552 0.000112
H  -1.001239 -3.144147 -0.000234
H  -2.222355 2.439308 0.000031
