program: Gaussian 09
title: 000092637
version: EM64L-G09RevD.01
frameworkgroup: C1[X(C19H18N2O)]
method: RPBEPBE
basis: SDD
operation: Freq
keyword: #p
keyword: freq=noraman
keyword: PBEPBE/SDD
title: #p freq=noraman PBEPBE/SDD
converged: YES YES NO NO
title: Mulliken charges:
elementType: O N N C C C C C C C C C C C C C C C C C C C H H H H H H H H H H H H H H H H H H
charge: -0.460548 -0.699891 -0.700575 -0.100282 0.429386 0.408213 0.261905 -0.396232 -0.353381 -0.371653 -0.420332 -0.347081 -0.380013 -0.446545 -0.442375 -0.418637 -0.429186 0.497774 0.501211 -0.246172 -0.249984 -0.243289 0.252656 0.249127 0.260078 0.231962 0.275862 0.262485 0.343280 0.212948 0.214323 0.210729 0.211805 0.225884 0.223877 0.226160 0.300684 0.301462 0.302487 0.301879
chargesum: 0.00000
title: Mulliken charges with hydrogens summed into heavy atoms:
elementType: O N N C C C C C C C C C C C C C C C C C C C
charge: -0.117268 -0.097745 -0.096209 -0.100282 0.429386 0.408213 0.261905 -0.143576 -0.104254 -0.111575 -0.188370 -0.071220 -0.117528 -0.233597 -0.228052 -0.207909 -0.217381 0.497774 0.501211 -0.020288 -0.026107 -0.017129
polarizability: 2.65629789e+02 2.28945805e+00 2.31211343e+02 -2.26589886e+00 -7.67994613e+00 1.77407801e+02
1716.lowfreq: -2.2445 -0.0007 -0.0004 -0.0003 7.1925 11.2629 16.7888 35.3550 45.1599
frequency: 16.7286 35.3152 45.1197 48.5241 62.2948 76.3853 143.7770 161.0909 189.0741 218.3477 243.0104 268.9593 278.9357 308.3229 317.9021 323.4472 327.4068 343.0963 364.4026 364.6166 372.5817 379.1469 400.0816 402.6974 408.6386 410.7906 465.4672 512.3491 533.6787 568.1223 576.1770 595.3245 615.8719 637.6242 638.5303 661.1270 707.5709 727.1729 737.2269 767.9810 811.5483 813.8359 816.7684 817.2338 824.2986 827.2591 859.2652 878.9706 902.1659 929.4030 941.1610 948.5526 953.8044 959.6248 964.2286 985.1230 990.0702 997.6573 1002.4030 1005.2116 1016.2951 1019.7554 1028.7505 1084.2533 1131.0763 1133.5903 1151.1601 1163.7180 1171.3110 1187.0103 1190.8185 1195.0872 1212.6398 1288.8901 1307.0983 1310.9610 1313.3021 1317.0895 1319.6610 1376.3007 1378.6007 1382.6214 1427.7324 1432.1737 1434.4832 1477.9742 1512.3646 1517.3594 1579.4701 1581.6408 1588.0153 1608.2676 1629.6763 1630.6153 1641.0726 1642.9216 3111.3115 3113.2520 3115.4869 3115.7723 3120.6885 3130.8326 3138.7284 3142.8709 3145.7778 3153.0025 3154.7651 3163.3124 3164.4198 3543.3558 3568.4343 3568.8817 3709.0796 3709.7572
redmass: 3.8168 4.3156 4.2350 4.0925 4.5546 4.6444 4.8279 4.7717 4.7723 5.1236 5.2168 3.9978 1.4889 2.9950 3.7499 1.3901 1.2691 3.8269 1.0829 1.0438 2.7541 4.7827 2.9654 2.8824 2.7126 2.8472 4.3585 3.0761 2.7782 3.5621 4.4653 5.0596 6.3693 6.9089 6.9337 5.6896 1.7460 3.4629 3.8152 2.0009 2.7178 2.1886 1.3310 1.5787 2.2541 2.4737 1.2503 3.0170 4.3155 2.0392 1.6672 1.5946 1.7657 1.5643 1.3694 1.3772 6.2317 1.3119 2.7813 2.7640 1.4369 1.4925 2.1394 1.6104 1.2303 1.2488 2.3341 2.2059 1.0542 1.1837 1.1264 1.1387 3.2492 1.7425 1.5808 2.2980 2.1354 1.6099 1.3651 6.0142 5.9483 6.4386 3.5454 2.8995 2.6371 2.1904 2.9692 3.0166 6.8374 6.8796 6.2469 5.9878 2.1923 1.8765 1.8811 1.9323 1.0876 1.0882 1.0885 1.0887 1.0846 1.0884 1.0953 1.0943 1.0930 1.0939 1.0951 1.0944 1.1002 1.0660 1.0446 1.0446 1.1040 1.1040
irintensity: 0.1740 1.3086 0.2063 0.2163 1.6782 1.6792 1.7288 2.2843 1.7621 14.1746 2.9748 16.5640 91.8782 20.9733 1.0494 309.4058 279.4715 63.8685 0.5659 1.5006 3.0738 0.6346 0.8844 0.3124 1.2700 0.2323 5.2921 5.3848 5.4198 13.4576 27.4723 33.5264 0.1165 0.6011 1.0775 4.6125 50.0865 0.2350 1.7419 59.4607 19.6797 24.4334 13.0091 12.1396 46.2373 63.3036 0.6297 22.2040 8.2816 15.7731 8.8702 1.6835 11.0769 4.8475 0.2524 0.6907 0.3849 0.0356 0.9150 1.9830 0.6718 5.6472 10.5775 2.8828 3.5394 14.5214 36.9857 19.0600 0.5509 74.0072 21.8219 12.5891 17.4465 48.6689 19.1566 45.0370 66.3135 54.0292 5.6106 7.3329 16.2914 12.8722 0.9979 8.6771 7.3882 17.7900 159.9328 91.6689 6.3136 7.5132 4.5695 3.9209 4.6149 0.9514 416.5801 213.6413 16.8984 13.5361 47.5628 29.1206 0.1513 11.0996 14.1300 18.7315 23.6900 8.8663 22.7243 6.3945 20.1444 10.5799 87.3965 58.7165 18.8952 18.6175
temp: 298.150 k
press: 1.00000 atm
elementType: 8 7 7 6 6 6 6 6 6 6 6 6 6 6 6 6 6 6 6 6 6 6 1 1 1 1 1 1 1 1 1 1 1 1 1 1 1 1 1 1
symmnumber: 1
zpe: 841794.1 jmol-1
zpe.correction: 0.320622 hartree
zpe.thermalcorrener: 0.340481 hartree
zpe.thermalcorrenthalpy: 0.341426 hartree
zpe.thermalcorrgfe: 0.271511 hartree
zpe.sumelectzpe: -918.010176 hartree
zpe.sumelectthermal: -917.990317 hartree
zpe.sumelectthermalent: -917.989373 hartree
zpe.sumelectthermalfe: -918.059288 hartree
dipole: -0.9816 -1.6230 -2.0071
dipole: 2.7616
quadrupole: -94.9461 -113.1837 -122.2346
quadrupole: -0.2294 -3.4786 2.7680
quadrupole: 15.1753 -3.0622 -12.1131 -0.2294 -3.4786 2.7680
hfenergy: -918.3307985 hartree
pointgroup: C01 [X(C19H18N2O1)]
dipole: 0.3923583 -0.6374951 0.7874624 debye
polarizability: 265.7506158|-1.6032438|230.9811052|-1.6078246|8.117281|177.5172123 unknown
InChI: InChI=1S/C19H18N2O/c20-17-10-6-15(7-11-17)19(22,14-4-2-1-3-5-14)16-8-12-18(21)13-9-16/h1-13,22H,20-21H2
charge 0 multiplicity 1
40 atoms
O  -0.094921 0.513918 -2.256905
N  -4.552278 -2.959719 0.664923
N  4.844101 -2.415871 0.77475
C  -0.02462 0.378028 -0.764489
C  -1.261873 -0.456079 -0.388055
C  1.265327 -0.38011 -0.372321
C  -0.077842 1.811535 -0.187432
C  -1.994272 -0.23274 0.802114
C  1.425199 -0.909566 0.934624
C  -1.648324 -1.541306 -1.215016
C  2.330018 -0.561621 -1.286566
C  -1.173297 2.639167 -0.560476
C  0.931494 2.355707 0.642963
C  -3.082003 -1.055919 1.159558
C  2.600804 -1.57905 1.321089
C  -2.735505 -2.365764 -0.876059
C  3.514063 -1.233182 -0.917893
C  -3.47273 -2.138942 0.32344
C  3.673415 -1.750916 0.398092
C  -1.257667 3.972396 -0.110563
C  0.84758 3.694046 1.096064
C  -0.245115 4.506964 0.723293
H  -1.725717 0.603128 1.458516
H  0.609938 -0.811423 1.660282
H  -1.09417 -1.722584 -2.140996
H  2.223852 -0.204053 -2.31582
H  -1.953351 2.221263 -1.206044
H  1.785436 1.73605 0.934158
H  0.488188 1.273993 -2.514541
H  -3.635088 -0.857796 2.086405
H  2.690089 -1.980711 2.338422
H  -3.020928 -3.19309 -1.538337
H  4.317493 -1.3651 -1.653786
H  -2.109475 4.595048 -0.407526
H  1.638703 4.098949 1.737683
H  -0.308487 5.543323 1.074474
H  -5.080012 -2.79835 1.517148
H  -4.831098 -3.728215 0.062919
H  4.94455 -2.803897 1.707612
H  5.598721 -2.55711 0.110297
