program: Gaussian 09
title: 000092606
version: EM64L-G09RevD.01
frameworkgroup: C1[X(C13H20O)]
method: RPBEPBE
basis: SDD
operation: Freq
keyword: #pfreq=noraman
keyword: PBEPBE/SDD
title: #p freq=noraman PBEPBE/SDD
converged: YES YES NO NO
title: Mulliken charges:
elementType: O C C C C C C C C C C C C C H H H H H H H H H H H H H H H H H H H H
charge: -0.223464 0.348273 -0.463111 -0.550627 -0.472248 0.320985 -0.755224 -0.757494 -0.327676 0.031165 -0.500448 -0.465098 -0.034247 -0.598929 0.211098 0.210191 0.221889 0.213911 0.230868 0.222938 0.212789 0.208738 0.236292 0.216838 0.212230 0.211710 0.264813 0.231314 0.248149 0.219824 0.233672 0.207165 0.213473 0.220243
chargesum: 0.00000
title: Mulliken charges with hydrogens summed into heavy atoms:
elementType: O C C C C C C C C C C C C C
charge: -0.223464 0.348273 -0.041822 -0.114828 -0.018442 0.320985 -0.097404 -0.116717 -0.062864 0.031165 -0.020985 -0.011602 0.172918 -0.165213
polarizability: 1.84301240e+02 -1.39415882e+01 1.37113674e+02 -5.88280354e+00 1.34569162e+00 1.06841611e+02
1716.lowfreq: -9.9865 -0.0007 -0.0004 -0.0003 5.5729 13.4727 31.9554 48.3475 61.9672
frequency: 31.0184 48.3350 61.9052 73.5854 100.4436 126.0264 174.5536 204.1965 206.5500 232.4350 247.8322 268.5063 295.7888 313.4228 341.2150 364.9614 384.1740 403.5540 428.2325 469.8377 483.4298 559.0129 563.5818 632.9802 699.4415 719.4728 774.4410 810.1843 873.3278 876.9040 885.0391 915.4106 925.8591 937.5556 939.5721 939.9969 962.3171 974.3740 997.7354 1004.3572 1005.8044 1027.5663 1062.9795 1087.3852 1097.0451 1129.8036 1155.1962 1159.9358 1189.2861 1202.1559 1210.1583 1257.9094 1271.8221 1275.6722 1282.3977 1293.1443 1306.9517 1332.9348 1338.3283 1347.4228 1355.8256 1376.4446 1393.6023 1426.0335 1428.3309 1446.0422 1453.1626 1459.4251 1460.5747 1469.0052 1475.0698 1481.5048 1491.6064 1563.0581 1653.6388 1658.5140 2946.2617 2950.9156 2956.1668 2963.2063 2970.1473 2974.3222 2991.1123 3002.5714 3006.6134 3012.0390 3034.2220 3051.9814 3058.2007 3061.8986 3065.1000 3069.5640 3075.2289 3089.2005 3112.5667 3193.5158
redmass: 3.9150 2.6387 3.1900 3.1323 2.5685 2.3827 2.5683 2.8611 1.1272 1.5186 2.8282 1.4180 2.2989 2.8460 3.7390 2.5373 2.7213 1.8797 2.0782 2.7729 3.5013 3.7771 2.0742 1.5807 4.3201 2.0449 1.5662 2.4395 1.9913 1.6637 2.4654 1.9952 1.9024 1.8876 1.4165 1.4026 1.5974 1.7302 2.0928 1.5556 1.2989 1.6450 3.1601 1.4099 1.4782 1.5961 1.8291 1.5062 1.6848 1.7252 1.9121 1.3719 1.8354 1.4093 1.5082 1.2537 1.5226 1.5565 1.6346 1.6590 2.1536 1.2029 1.2139 1.1741 1.1072 1.0922 1.0793 1.0979 1.0705 1.0528 1.0745 1.0594 1.0605 7.9253 7.0816 4.8030 1.0631 1.0654 1.0633 1.0359 1.0463 1.0514 1.0627 1.0900 1.0952 1.0924 1.1024 1.0936 1.0995 1.0993 1.0986 1.0867 1.0987 1.0719 1.0903 1.1145
irintensity: 1.0502 0.1014 2.1688 1.9742 0.3131 0.5996 0.1965 3.4359 0.1394 0.6294 1.4547 0.3337 0.3433 2.8814 5.8748 0.5978 0.3721 0.4367 3.8923 2.6704 3.3053 0.9766 2.1210 24.8037 11.6884 9.4397 13.7466 1.0831 2.4660 7.4329 6.9071 1.5393 20.9267 6.6310 16.2881 67.4293 9.6550 6.2141 0.6197 19.1050 5.3608 2.9846 2.0884 5.2414 0.7168 2.4836 20.3822 41.3705 2.7449 57.9102 3.2704 67.1883 2.2697 20.5677 8.2812 6.0767 3.3107 0.8838 30.0260 9.1850 16.7910 21.2602 13.8942 3.9581 11.6359 28.2044 6.3482 18.2566 3.4238 13.3727 10.1652 8.8190 6.2735 154.7188 62.6932 19.0002 30.4692 26.0496 19.9918 31.0341 40.3135 30.8905 12.2858 41.6444 14.1998 9.8139 35.2755 2.8008 16.0573 29.8425 68.6801 49.1346 39.9636 6.9026 3.9242 31.6646
temp: 298.150 k
press: 1.00000 atm
elementType: 8 6 6 6 6 6 6 6 6 6 6 6 6 6 1 1 1 1 1 1 1 1 1 1 1 1 1 1 1 1 1 1 1 1
symmnumber: 1
zpe: 774355.5 jmol-1
zpe.correction: 0.294936 hartree
zpe.thermalcorrener: 0.310525 hartree
zpe.thermalcorrenthalpy: 0.311469 hartree
zpe.thermalcorrgfe: 0.251677 hartree
zpe.sumelectzpe: -581.480979 hartree
zpe.sumelectthermal: -581.465391 hartree
zpe.sumelectthermalent: -581.464446 hartree
zpe.sumelectthermalfe: -581.524239 hartree
dipole: -2.7971 -2.4570 -0.1679
dipole: 3.7268
quadrupole: -85.7617 -92.5837 -85.1305
quadrupole: -7.1590 -0.1271 -1.8943
quadrupole: 2.0636 -4.7584 2.6948 -7.1590 -0.1271 -1.8943
hfenergy: -581.7759155 hartree
pointgroup: C01 [X(C13H20O1)]
dipole: -1.103708 0.9647764 0.0295406 debye
polarizability: 184.3289217|14.4083468|137.2758455|3.9815028|-0.4982694|106.6517577 unknown
InChI: InChI=1S/C13H20O/c1-4-5-8-12(14)11-7-6-9-13(2,3)10-11/h4,7H,1,5-6,8-10H2,2-3H3
charge 0 multiplicity 1
34 atoms
O  1.35201 -2.217918 -0.020505
C  -2.51047 0.955554 0.012878
C  -3.282683 -0.11269 0.840067
C  -0.9821 0.76374 0.255502
C  -2.894347 -1.557979 0.452733
C  -0.522848 -0.688948 0.175527
C  -2.828597 0.808943 -1.499722
C  -2.926368 2.370674 0.483882
C  -1.407794 -1.728967 0.268626
C  0.938238 -1.018676 0.013698
C  1.928352 0.145966 -0.118432
C  3.406365 -0.305259 -0.101036
C  4.351431 0.835793 -0.407588
C  5.3491 1.271698 0.402703
H  -4.37327 0.033279 0.712844
H  -3.059702 0.045724 1.914613
H  -0.720523 1.175419 1.254157
H  -0.428033 1.382771 -0.477901
H  -3.406064 -1.861068 -0.486612
H  -3.256005 -2.273401 1.218896
H  -3.920158 0.851654 -1.676122
H  -2.361294 1.630377 -2.075259
H  -2.451443 -0.14432 -1.911237
H  -3.995593 2.559675 0.271405
H  -2.770148 2.491948 1.572851
H  -2.336606 3.151884 -0.032883
H  -1.001799 -2.747939 0.196795
H  1.703791 0.680325 -1.067346
H  1.738993 0.887557 0.683122
H  3.645729 -0.752866 0.880707
H  3.526357 -1.117821 -0.844514
H  4.200269 1.335531 -1.379176
H  6.005208 2.101024 0.114672
H  5.540102 0.805416 1.377556
