program: Gaussian 09
title: 000092613
version: EM64L-G09RevD.01
frameworkgroup: C1[X(C7H15N3O3S)]
method: RPBEPBE
basis: SDD
operation: Freq
keyword: #p
keyword: freq=noraman
keyword: PBEPBE/SDD
title: #p freq=noraman PBEPBE/SDD
converged: YES YES NO NO
title: Mulliken charges:
elementType: S O O O N N N C C C C C C C H H H H H H H H H H H H H H H
charge: -0.113929 -0.418403 -0.419457 -0.431238 -0.115009 -0.073276 -0.072249 -0.333406 -0.330199 -0.357697 -0.109084 -0.331872 -0.331716 -0.316859 0.240236 0.228338 0.227847 0.230089 0.188895 0.232035 0.258996 0.204846 0.202533 0.259204 0.242587 0.186804 0.357493 0.357287 0.337204
chargesum: 0.00000
title: Mulliken charges with hydrogens summed into heavy atoms:
elementType: S O O O N N N C C C C C C C
charge: -0.113929 -0.060910 -0.062170 -0.094034 -0.115009 -0.073276 -0.072249 0.135169 0.127737 0.063233 -0.109084 0.131971 0.130020 0.112531
polarizability: 1.59179766e+02 5.78926678e-01 1.31561444e+02 -9.06918110e+00 1.94686094e-01 8.80902931e+01
1716.lowfreq: -8.1844 -6.4708 -0.0010 0.0013 0.0024 6.9589 27.3122 41.6108 68.1845
frequency: 27.0770 41.4366 68.1783 70.6211 76.4569 101.7139 112.7892 152.7704 195.9957 229.8099 271.7724 282.7445 303.6213 309.4021 313.9634 334.0391 366.6043 385.3487 474.2580 496.9857 573.8581 581.9446 585.9374 619.5442 641.1529 688.2291 795.5128 880.8425 897.9414 957.9628 962.8468 966.4464 969.9358 985.0914 1015.3486 1032.4811 1043.5384 1045.1394 1069.5285 1114.7994 1118.2938 1132.7619 1189.9574 1201.9792 1224.0547 1231.1557 1269.5962 1276.9770 1282.8851 1301.1817 1330.9657 1345.8080 1351.5249 1352.3449 1373.8660 1388.7204 1400.4991 1401.5275 1428.8894 1436.2280 1454.1431 1466.4789 1474.4000 1479.8588 1492.6239 1514.0468 2832.6359 2843.4582 2866.3277 2963.7894 3016.7239 3017.9131 3039.9375 3048.9775 3050.6436 3107.0671 3108.1447 3108.8437 3410.3992 3416.8069 3561.7199
redmass: 3.8055 3.9545 7.3865 2.4267 3.6442 4.4212 3.4787 6.7543 5.2653 2.5158 4.0728 4.1342 1.7843 2.0725 1.9200 2.5482 6.1673 5.5444 2.9323 4.5092 1.6395 1.3844 4.3838 3.5665 2.7363 5.1820 1.1443 4.3931 4.0795 3.4895 3.9014 3.6341 2.9149 2.1442 1.7161 2.1452 2.7776 1.8176 2.8467 2.1803 3.0549 1.6349 1.4545 1.1024 2.2226 3.3809 1.4228 1.3319 1.3045 1.2064 1.4736 1.3254 1.2883 1.2639 1.4121 1.6318 1.2650 1.1949 1.2066 1.1310 1.1993 1.1171 1.1467 1.0963 1.1114 2.2956 1.0715 1.0707 1.0711 1.0702 1.0618 1.0619 1.0887 1.0889 1.0880 1.1033 1.1034 1.0961 1.0645 1.0646 1.0664
irintensity: 3.5626 5.3269 0.4432 7.8319 0.6476 5.6195 4.6547 3.9210 0.0302 5.7684 2.3458 1.0297 91.8115 14.3038 35.8082 42.6619 20.9367 3.5973 7.1798 9.1140 124.1855 87.2707 4.9556 162.6816 27.0346 27.9945 5.5067 38.7749 78.3636 84.5707 84.2562 154.5235 74.0667 30.9177 0.9254 33.8571 3.8209 48.8983 3.4705 80.6372 86.7166 25.8168 261.4699 41.4451 8.0444 2.6893 3.1206 17.1266 23.4474 13.1494 62.1616 94.0537 80.8632 44.4641 44.8574 73.1714 60.0861 50.6555 9.3385 1.0102 17.6348 6.0577 24.6089 4.4740 14.3500 221.4371 50.1616 71.8110 154.8952 55.4105 28.2276 45.5340 13.0366 16.0332 30.9045 20.3186 20.7738 24.7875 48.6680 26.8823 10.4045
temp: 298.150 k
press: 1.00000 atm
elementType: 16 8 8 8 7 7 7 6 6 6 6 6 6 6 1 1 1 1 1 1 1 1 1 1 1 1 1 1 1
symmnumber: 1
zpe: 618217.1 jmol-1
zpe.correction: 0.235466 hartree
zpe.thermalcorrener: 0.250982 hartree
zpe.thermalcorrenthalpy: 0.251926 hartree
zpe.thermalcorrgfe: 0.190961 hartree
zpe.sumelectzpe: -1062.556198 hartree
zpe.sumelectthermal: -1062.540682 hartree
zpe.sumelectthermalent: -1062.539738 hartree
zpe.sumelectthermalfe: -1062.600704 hartree
dipole: -4.3718 0.0871 0.9726
dipole: 4.4795
quadrupole: -106.4257 -95.0823 -95.7716
quadrupole: -4.7302 -10.5364 0.1779
quadrupole: -7.3325 4.0109 3.3216 -4.7302 -10.5364 0.1779
hfenergy: -1062.7916642 hartree
pointgroup: C01 [X(C7H15N3O3S1)]
dipole: -1.7103865 -0.188938 0.3805363 debye
polarizability: 158.5855707|4.1894568|132.1458958|-9.0284807|0.2120124|88.1000365 unknown
InChI: InChI=1S/C7H15N3O3S/c11-2-1-8-3-9(5-12)7(14)10(4-8)6-13/h11-13H,1-6H2
charge 0 multiplicity 1
29 atoms
S  3.074555 0.731638 -0.724435
O  3.056595 -2.159374 0.718967
O  1.661138 3.091595 0.968249
O  -5.041862 -0.670205 -0.295818
N  -1.263402 -0.459178 -0.013438
N  1.067365 -1.054904 -0.203575
N  0.459398 1.228493 -0.086852
C  -0.251227 -1.467947 0.329879
C  -0.860875 0.868194 0.473646
C  -2.648668 -0.83911 0.343427
C  1.425703 0.2715 -0.323384
C  2.103865 -2.105132 -0.369443
C  0.830447 2.664173 -0.138109
C  -3.681696 -0.230564 -0.631186
H  -0.535177 -2.424727 -0.141735
H  -0.158124 -1.637639 1.433841
H  -0.811945 0.913814 1.593293
H  -1.597555 1.61585 0.134427
H  -2.906009 -0.552415 1.394837
H  -2.741812 -1.938519 0.285026
H  2.605845 -1.921268 -1.337151
H  1.592869 -3.079966 -0.369203
H  -0.097671 3.250714 -0.05932
H  1.329305 2.840523 -1.108776
H  -3.497979 -0.607643 -1.648296
H  -3.612578 0.877662 -0.651966
H  3.6418 -1.355151 0.618063
H  2.564573 2.694148 0.807296
H  -5.314679 -0.27356 0.569935
