program: Gaussian 09
title: 000092574
version: EM64L-G09RevD.01
frameworkgroup: C1[X(C10H16O)]
method: RPBEPBE
basis: SDD
operation: Freq
keyword: #pfreq=noraman
keyword: PBEPBE/SDD
title: #p freq=noraman PBEPBE/SDD
converged: YES YES NO NO
title: Mulliken charges:
elementType: O C C C C C C C C C C H H H H H H H H H H H H H H H H
charge: -0.223024 -0.425010 -0.511400 -0.409224 0.315993 -0.442206 -0.318839 -0.151859 0.044732 -0.704366 -0.696010 0.208372 0.206897 0.213675 0.219996 0.211548 0.204653 0.220373 0.222539 0.261146 0.215721 0.217647 0.204476 0.241419 0.220481 0.233364 0.218907
chargesum: 0.00000
title: Mulliken charges with hydrogens summed into heavy atoms:
elementType: O C C C C C C C C C C
charge: -0.223024 -0.009742 -0.077729 0.006977 0.315993 0.000706 -0.057693 0.063863 0.044732 -0.040824 -0.023258
polarizability: 1.39326633e+02 6.02004535e+00 1.04876895e+02 3.23241775e+00 1.40065191e+00 8.27762801e+01
1716.lowfreq: -21.8215 -6.9045 0.0004 0.0006 0.0007 10.3068 38.1924 45.9632 98.7180
frequency: 37.9914 45.2569 98.7140 158.5932 180.8466 200.2845 229.1154 235.4064 275.2329 293.0011 313.6466 377.8899 404.0626 456.8735 476.4254 537.1402 664.6027 696.7971 745.2608 803.5356 832.7012 869.0297 871.3789 919.0672 923.0424 935.7689 947.3169 963.4496 983.7720 1071.6117 1077.2051 1082.7737 1097.5204 1108.0776 1134.2367 1151.9477 1172.8502 1203.4777 1237.5702 1261.9581 1277.4610 1303.0972 1332.7617 1336.5089 1345.1983 1348.6296 1365.9947 1374.6252 1391.1021 1444.3180 1456.4960 1460.7896 1468.9911 1471.2743 1475.3745 1476.2382 1487.9538 1559.1373 1650.8717 2948.2462 2957.6245 2977.8985 2979.7109 2981.1268 2986.3011 3003.9647 3005.3714 3013.5828 3042.3660 3050.4611 3075.3320 3080.5691 3082.2458 3097.4117 3111.4810
redmass: 3.8308 2.6175 2.7989 2.9864 1.1670 1.9725 1.5386 1.5513 2.5791 2.0949 4.0784 3.0401 2.2645 2.7392 3.4434 3.6294 2.5495 3.1312 2.7211 1.3712 3.6079 2.4916 1.6326 1.6597 1.4659 1.8815 1.6506 1.4153 2.7615 1.7677 1.8263 1.5945 1.8830 1.9537 1.2087 2.0239 1.5786 2.3673 1.3221 1.2021 1.3405 1.2707 1.7127 1.4194 1.6325 1.5646 1.6940 1.2269 1.2153 1.0997 1.0792 1.0498 1.0508 1.0854 1.0793 1.0602 1.0630 7.9802 7.0441 1.0651 1.0625 1.0345 1.0658 1.0640 1.0364 1.0834 1.0894 1.0929 1.0984 1.1040 1.1001 1.0997 1.1009 1.0992 1.0900
irintensity: 2.0962 0.1301 1.0763 0.8015 0.3506 0.2848 0.6777 1.2213 0.2686 2.7518 5.3284 0.7474 2.4076 5.9388 2.2613 1.6692 4.0641 9.8787 2.6906 10.1364 12.3526 3.2505 4.1452 16.1424 17.7220 8.3179 1.4982 3.1189 29.5742 0.2879 1.6630 13.4511 29.1752 1.6967 7.1504 56.2368 0.1473 67.8163 2.2299 2.7583 8.9843 0.7147 1.7082 2.6960 11.1757 9.4438 1.8920 16.4917 30.1785 23.0062 9.4505 7.2693 5.6790 10.1000 1.5646 21.2347 21.7073 137.8996 48.6516 26.7948 33.1936 29.9074 31.0363 20.3361 36.3402 7.4627 46.2076 30.8167 57.6441 62.6181 30.3156 48.5705 19.0273 32.4569 3.7093
temp: 298.150 k
press: 1.00000 atm
elementType: 8 6 6 6 6 6 6 6 6 6 6 1 1 1 1 1 1 1 1 1 1 1 1 1 1 1 1
symmnumber: 1
zpe: 619043.2 jmol-1
zpe.correction: 0.235781 hartree
zpe.thermalcorrener: 0.247731 hartree
zpe.thermalcorrenthalpy: 0.248676 hartree
zpe.thermalcorrgfe: 0.197505 hartree
zpe.sumelectzpe: -465.008286 hartree
zpe.sumelectthermal: -464.996336 hartree
zpe.sumelectthermalent: -464.995391 hartree
zpe.sumelectthermalfe: -465.046562 hartree
dipole: 2.1873 -2.7826 0.3271
dipole: 3.5544
quadrupole: -64.4981 -71.5523 -67.5010
quadrupole: 6.2465 -0.5912 1.2223
quadrupole: 3.3524 -3.7018 0.3494 6.2465 -0.5912 1.2223
hfenergy: -465.2440669 hartree
pointgroup: C01 [X(C10H16O1)]
dipole: -0.8667347 -1.0684543 -0.250491 debye
polarizability: 139.1729565|-6.6036152|105.0281002|3.1056744|0.8507868|82.7787513 unknown
InChI: InChI=1S/C10H16O/c1-8(2)10(11)9-6-4-3-5-7-9/h6,8H,3-5,7H2,1-2H3
charge 0 multiplicity 1
27 atoms
O  1.516385 1.726529 0.348123
C  -2.354302 -1.346804 0.472636
C  -0.828581 -1.2523 0.22671
C  -3.132761 -0.402443 -0.469609
C  -0.347695 0.193142 0.121936
C  -2.720098 1.066111 -0.215657
C  -1.226857 1.227969 -0.054301
C  2.15261 -0.603264 0.026445
C  1.121596 0.528713 0.203857
C  3.489163 -0.268967 0.719834
C  2.354482 -0.823157 -1.504333
H  -2.68894 -2.392996 0.340011
H  -2.572792 -1.067486 1.522896
H  -0.564319 -1.808053 -0.697627
H  -0.297922 -1.767512 1.051351
H  -4.223251 -0.521951 -0.328115
H  -2.911152 -0.671564 -1.5216
H  -3.22038 1.450579 0.700242
H  -3.074365 1.720784 -1.037336
H  -0.807855 2.243776 -0.088414
H  1.743716 -1.541063 0.448292
H  3.362763 -0.179772 1.813902
H  4.236976 -1.057894 0.518522
H  3.878866 0.695727 0.352689
H  3.056074 -1.659416 -1.676704
H  2.779914 0.08696 -1.964562
H  1.405625 -1.058348 -2.020492
