program: Gaussian 09
title: 000092616
version: EM64L-G09RevD.01
frameworkgroup: C1[X(C15H10N2O3)]
method: RPBEPBE
basis: SDD
operation: Freq
keyword: #p
keyword: freq=noraman
keyword: PBEPBE/SDD
title: #p freq=noraman PBEPBE/SDD
converged: YES YES NO NO
title: Mulliken charges:
elementType: O O O N N C C C C C C C C C C C C C C C H H H H H H H H H H
charge: -0.248528 -0.214806 -0.197726 -0.484912 0.019603 0.268926 0.203636 0.302651 0.137503 0.324402 -0.442493 -0.510632 -0.372332 0.389022 -0.368145 -0.378022 -0.410553 -0.228728 -0.229244 -0.229310 0.329827 0.266973 0.331112 0.241433 0.292563 0.257662 0.235977 0.238068 0.235871 0.240206
chargesum: 0.00000
title: Mulliken charges with hydrogens summed into heavy atoms:
elementType: O O O N N C C C C C C C C C C C C C C C
charge: -0.248528 -0.214806 -0.197726 -0.155086 0.019603 0.268926 0.203636 0.302651 0.137503 0.324402 -0.175521 -0.179519 -0.130899 0.389022 -0.075582 -0.120360 -0.174576 0.009340 0.006627 0.010895
polarizability: 3.56081310e+02 -3.53808862e+00 1.98784222e+02 3.54272230e+00 5.38104467e+00 8.06615027e+01
1716.lowfreq: -8.7635 -3.5694 -0.0006 -0.0003 0.0001 5.7059 33.5000 45.7059 58.6303
frequency: 33.4326 45.6550 58.6154 75.2109 99.0723 155.3541 158.9482 182.7121 218.0799 235.8743 290.4155 304.5461 344.9694 385.0947 403.3647 436.8864 471.9531 495.1546 511.1396 523.6537 525.1353 590.1087 613.1730 614.6152 625.7875 654.3791 659.6234 667.1681 702.2682 715.9397 734.9662 771.6952 778.8030 797.8803 836.2271 853.4018 871.1732 883.4216 918.5741 932.2245 979.8697 981.3742 987.3249 989.5836 1003.7475 1024.8317 1049.9722 1054.0748 1088.8297 1116.3946 1141.7220 1178.1377 1196.4595 1209.0255 1233.2233 1255.3532 1259.3537 1289.5875 1319.9956 1345.2405 1365.0620 1383.1183 1403.5553 1428.3898 1436.5015 1472.9786 1484.8921 1501.1256 1547.1738 1582.6098 1593.6971 1607.6634 1614.6965 1633.4753 3115.4996 3134.1733 3136.4546 3146.5150 3157.5569 3172.3534 3173.5172 3185.1243 3187.1678 3540.6193
redmass: 6.7636 5.1207 9.7084 5.9845 6.4025 6.3824 9.0535 4.2904 6.4504 6.5052 8.7694 6.1936 6.1518 6.7405 2.8373 3.6302 4.5858 8.1174 6.3203 4.3570 5.4320 5.0034 3.5054 4.1419 2.0737 3.6318 3.9472 6.9520 1.7781 5.3704 8.4917 2.2681 2.5744 5.1935 1.5892 1.2559 1.6230 5.5539 3.9135 1.6414 1.5746 1.4037 1.3659 3.9076 1.3313 2.7443 2.3224 1.9015 1.6077 4.8422 1.2666 1.0535 1.1246 6.9703 2.0545 2.0806 2.0324 2.4407 1.4365 2.1200 9.5794 6.2677 4.5009 6.8650 2.3755 2.8387 2.4933 4.2604 9.8028 5.2972 4.6308 7.9457 6.1755 6.4992 1.0887 1.0909 1.0863 1.0912 1.0961 1.1016 1.0923 1.0922 1.0948 1.0771
irintensity: 0.2441 0.5351 1.9888 0.7077 0.2286 1.8530 1.8526 0.5311 0.0433 0.9080 3.3796 1.9783 0.8602 5.0316 0.3967 2.4293 5.2097 3.4790 13.8594 8.5575 5.9964 3.4830 9.5640 7.5895 33.8025 1.1918 21.8555 11.2864 39.6611 30.2108 18.9836 35.2812 21.1908 3.2892 48.1028 1.5326 35.1775 7.1258 8.8453 2.9344 2.3074 16.4423 1.7834 1.3291 0.0436 5.2596 7.2174 35.3680 11.5207 6.0417 51.7106 0.0125 14.5419 518.9501 57.3972 9.2419 6.0605 5.0598 2.8428 10.2763 75.3122 0.2774 126.9317 15.2374 11.0346 23.6998 40.4895 185.7279 120.5002 41.5291 9.9142 87.4519 6.9322 354.9601 11.2840 6.9513 0.4220 9.4861 21.6889 21.3424 11.4085 2.4810 3.6640 55.2031
temp: 298.150 k
press: 1.00000 atm
elementType: 8 8 8 7 7 6 6 6 6 6 6 6 6 6 6 6 6 6 6 6 1 1 1 1 1 1 1 1 1 1
symmnumber: 1
zpe: 573518.0 jmol-1
zpe.correction: 0.218441 hartree
zpe.thermalcorrener: 0.233912 hartree
zpe.thermalcorrenthalpy: 0.234857 hartree
zpe.thermalcorrgfe: 0.174389 hartree
zpe.sumelectzpe: -911.346365 hartree
zpe.sumelectthermal: -911.330894 hartree
zpe.sumelectthermalent: -911.329950 hartree
zpe.sumelectthermalfe: -911.390418 hartree
dipole: 9.8244 -5.9155 0.7354
dipole: 11.4914
quadrupole: -129.8199 -117.0215 -116.1204
quadrupole: 2.6221 0.9328 4.2997
quadrupole: -8.8326 3.9657 4.8669 2.6221 0.9328 4.2997
hfenergy: -911.5648067 hartree
pointgroup: C01 [X(C15H10N2O3)]
dipole: -3.8719651 2.2588016 -0.5880383 debye
polarizability: 355.9720456|-5.4204044|176.9438736|-5.4307317|-46.1051716|102.611116 unknown
InChI: InChI=1S/C15H10N2O3/c18-15-9-14(10-4-2-1-3-5-10)16-13-7-6-11(17(19)20)8-12(13)15/h1-9,16H
charge 0 multiplicity 1
30 atoms
O  0.894879 -2.876969 0.924655
O  5.65158 1.294225 -0.414694
O  5.456789 -0.886213 0.232455
N  -0.697304 0.790297 -0.179135
N  4.950218 0.253408 -0.097333
C  0.691135 0.665094 -0.163304
C  1.271494 -0.588774 0.207489
C  -1.560233 -0.263083 0.145157
C  0.403419 -1.749885 0.579523
C  -3.015667 0.027729 0.06267
C  -1.034294 -1.493477 0.508778
C  2.678498 -0.717436 0.224628
C  1.520272 1.774464 -0.50036
C  3.475819 0.385556 -0.116075
C  2.910913 1.638013 -0.478406
C  -3.917647 -0.572168 0.982444
C  -3.532709 0.908104 -0.928307
C  -5.298904 -0.298705 0.912773
C  -4.915461 1.182377 -0.994103
C  -5.803677 0.581936 -0.072779
H  -1.104236 1.707219 -0.374197
H  -1.703776 -2.33034 0.720336
H  3.119314 -1.678074 0.50768
H  1.067658 2.733189 -0.778727
H  3.575378 2.467389 -0.732847
H  -3.530447 -1.231494 1.766432
H  -2.868456 1.338796 -1.688279
H  -5.980437 -0.764545 1.63231
H  -5.300291 1.851707 -1.770876
H  -6.876624 0.795261 -0.12371
