program: Gaussian 09
title: 000092567
version: EM64L-G09RevD.01
frameworkgroup: C1[X(C7H7ClO3S)]
method: RPBEPBE
basis: SDD
operation: Freq
keyword: #p
keyword: freq=noraman
keyword: PBEPBE/SDD
title: #p freq=noraman PBEPBE/SDD
converged: YES YES NO NO
title: Mulliken charges:
elementType: Cl S O O O C C C C C C C H H H H H H H
charge: 0.020856 0.995855 -0.555800 -0.499278 -0.490880 0.035101 0.481382 -0.404477 -0.149719 -0.376763 -0.179555 -0.793624 0.302642 0.246818 0.265553 0.239363 0.230532 0.246858 0.385137
chargesum: 0.00000
title: Mulliken charges with hydrogens summed into heavy atoms:
elementType: Cl S O O O C C C C C C C
charge: 0.020856 0.995855 -0.170663 -0.499278 -0.490880 0.035101 0.481382 -0.101835 -0.149719 -0.129946 0.085998 -0.076871
polarizability: 1.58583674e+02 9.30067007e+00 1.28533143e+02 -1.39148001e+00 1.36149380e+00 6.94592601e+01
1716.lowfreq: -38.4024 0.0012 0.0015 0.0020 4.0793 7.2229 11.0452 50.3623 93.0680
frequency: -38.2402 50.3082 93.0483 116.1521 130.2827 142.9621 197.8652 214.2059 229.6921 276.4784 300.5765 310.6385 333.9540 363.0512 420.7371 445.3690 451.4353 532.7633 570.2939 616.9313 657.1741 701.7538 818.0437 828.9968 843.6112 915.7657 956.5927 971.7700 989.5933 1004.6260 1052.0021 1067.6690 1104.4607 1145.0230 1219.3042 1257.2121 1355.6059 1393.8318 1402.3161 1462.1624 1468.3002 1473.1741 1562.6204 1603.3180 2983.9760 3067.4186 3096.9272 3140.5598 3142.2744 3171.9540 3480.6170
redmass: 1.0134 6.8827 4.9939 6.1384 5.8914 1.9230 6.8159 6.6885 2.8121 6.9799 4.9241 4.9672 8.1674 8.4631 5.7880 6.3063 3.4687 5.8367 6.8321 6.2000 7.2476 3.7522 5.8699 1.3566 10.4798 1.3240 7.4679 1.3577 2.3566 2.0895 1.5596 1.2503 2.4532 1.4668 2.1606 1.4975 3.4694 4.3356 1.2193 2.7412 1.1083 1.0601 6.1991 6.7217 1.0391 1.0950 1.1002 1.0900 1.0917 1.0958 1.0662
irintensity: 0.6576 3.8199 0.0449 0.7692 7.7167 67.7979 1.5029 6.2672 15.8711 19.0283 2.1430 17.8229 5.9627 13.6502 28.8076 46.5375 6.0024 101.6882 51.3943 10.8451 6.6969 2.6994 34.5679 26.7426 58.9711 4.9732 82.6135 1.7849 9.1986 2.0932 20.3015 72.4827 38.0460 6.6643 0.2346 8.2397 5.3465 4.0414 14.0072 85.0619 12.1727 15.2912 2.6021 2.5235 20.2889 15.7487 12.4470 3.6824 13.9261 3.3561 54.2184
temp: 298.150 k
press: 1.00000 atm
elementType: 17 16 8 8 8 6 6 6 6 6 6 6 1 1 1 1 1 1 1
symmnumber: 1
zpe: 329782.9 jmol-1
zpe.correction: 0.125608 hartree
zpe.thermalcorrener: 0.137875 hartree
zpe.thermalcorrenthalpy: 0.138820 hartree
zpe.thermalcorrgfe: 0.086692 hartree
zpe.sumelectzpe: -1353.659506 hartree
zpe.sumelectthermal: -1353.647238 hartree
zpe.sumelectthermalent: -1353.646294 hartree
zpe.sumelectthermalfe: -1353.698421 hartree
dipole: -4.8463 1.6964 1.0624
dipole: 5.2434
quadrupole: -69.6188 -86.8674 -90.2490
quadrupole: 2.0620 6.8024 -0.4572
quadrupole: 12.6263 -4.6223 -8.0040 2.0620 6.8024 -0.4572
hfenergy: -1353.7851132 hartree
pointgroup: C01 [X(C7H7Cl1O3S1)]
dipole: -1.9646698 -0.5214327 -0.3518101 debye
dipolederiv: -0.3225154 0.3287791 0.0180404 0.2673845 -0.4013812 -0.015234 0.0209826 -0.0255936 -0.0000196 1.8216118 0.3151612 -0.1117592 0.2067266 1.3659153 0.0675102 -0.1750379 0.049954 1.5503529 -0.5507787 -0.0190706 0.3162713 0.0124186 -0.5444602 -0.0885005 0.3445906 -0.036902 -0.8787567 -0.6142797 -0.0616304 0.0162064 -0.0666507 -0.6741218 -0.0409345 -0.0043299 0.0090335 -0.453552 -0.6860171 -0.0549273 -0.0891457 -0.0318144 -0.4703423 0.0791219 -0.0391045 0.0144107 -0.5575273 -0.1500973 0.0706747 -0.00713 -0.0203939 -0.2241995 0.0057518 -0.0989292 -0.0281565 -0.1164332 0.2627187 -0.3619148 -0.027545 -0.2161728 0.1012412 0.0174184 -0.0603384 0.0608031 -0.0147181 -0.2091057 0.2079666 0.0074105 -0.2158888 -0.1616455 0.0146239 0.0159098 -0.0035656 -0.098381 0.3705974 -0.7142818 -0.0179718 -0.1326457 0.6017249 0.0186246 -0.0146265 0.0361803 -0.0507618 0.0913866 0.0606498 -0.0050079 0.1220425 0.0326716 -0.0032888 0.0002117 -0.0078891 -0.1377303 -0.2306639 0.2415201 0.0102052 0.0091911 -0.0732454 0.0089095 0.0154122 -0.0036148 -0.0758454 -0.0874913 0.106431 0.0199966 0.0890873 -0.0462264 -0.0090235 0.0979274 -0.078899 0.0485573 0.1673297 -0.0055203 -0.0107829 0.019247 0.0589645 -0.0059015 -0.0126292 0.0000111 0.1525682 -0.0864592 -0.0481574 0.0015881 -0.0381545 0.078873 0.0010852 -0.0045693 -0.0000502 0.1495118 0.0639761 -0.0215297 0.0012 -0.023295 -0.0266966 -0.0053758 -0.0039526 -0.006441 0.1637074 0.0574964 -0.0694193 0.0467749 0.0058858 -0.0592412 0.0771545 -0.0061752 0.0932339 0.0756172 -0.0777483 -0.0138316 -0.0736877 -0.0778989 0.0398601 -0.060951 -0.1022482 -0.0114744 0.0709791 0.0387341 0.0606971 0.0337816 0.0674827 0.0718631 -0.0280147 0.0692572 -0.0508955 -0.0841792 0.1413059 -0.0215962 -0.1284448 0.0234488 0.3304463 -0.0329758 -0.0423506 -0.010145 0.2566106 unknown
polarizability: 157.0768593|-11.2544347|129.9213|-2.2147156|2.984871|69.5779179 unknown
InChI: InChI=1S/C7H7ClO3S/c1-5-2-3-6(8)7(4-5)12(9,10)11/h2-4,9H,1H3
charge 0 multiplicity 1
19 atoms
Cl 1.21086 -2.528377 -0.123521
S  1.854298 0.833742 0.003735
O  2.310486 0.325776 -1.717187
O  1.681232 2.439817 0.056012
O  2.869836 0.114903 1.034341
C  0.119893 0.082003 -0.018845
C  -2.270172 0.579627 0.023553
C  -0.924384 1.021355 0.015261
C  -0.114762 -1.303472 -0.058184
C  -2.509683 -0.818275 -0.014735
C  -1.452319 -1.752151 -0.054136
C  -3.411328 1.575903 0.091792
H  -0.674195 2.088358 0.034942
H  -3.541405 -1.187561 -0.015758
H  -1.655675 -2.826498 -0.088678
H  -3.14363 2.532534 -0.388014
H  -4.317768 1.185646 -0.402043
H  -3.677444 1.798172 1.14303
H  3.309761 0.265298 -1.746967
