program: Gaussian 09
title: 000092569
version: EM64L-G09RevD.01
frameworkgroup: C1[X(C10H18O2)]
method: RPBEPBE
basis: SDD
operation: Freq
keyword: #pfreq=noraman
keyword: PBEPBE/SDD
title: #p freq=noraman PBEPBE/SDD
converged: YES YES NO NO
title: Mulliken charges:
elementType: O O C C C C C C C C C C H H H H H H H H H H H H H H H H H H
charge: -0.278640 -0.269044 -0.344009 -0.383248 -0.351447 -0.276281 -0.692746 0.240913 0.452536 -0.471392 -0.778364 -0.801557 0.188892 0.188616 0.208136 0.207588 0.196497 0.196660 0.223358 0.221544 0.210382 0.210297 0.217197 0.250252 0.228032 0.237378 0.227144 0.302809 0.218234 0.220263
chargesum: 0.00000
title: Mulliken charges with hydrogens summed into heavy atoms:
elementType: O O C C C C C C C C C C
charge: -0.278640 -0.269044 0.033499 0.032477 0.041710 0.168621 -0.054870 0.240913 0.452536 -0.221140 -0.085810 -0.060250
polarizability: 1.84675114e+02 -1.59971087e+00 1.05639170e+02 7.07432512e-01 1.77697516e-01 8.14733721e+01
1716.lowfreq: -0.0007 -0.0004 -0.0001 4.3751 7.7734 17.3428 26.8807 48.3169 54.5926
frequency: 26.8356 47.8291 54.3978 64.9619 93.1870 99.4891 112.1922 139.5003 143.0344 172.1074 209.7773 225.8343 242.3680 245.9731 330.7103 366.3016 388.3974 448.8329 465.8435 495.9901 693.7925 722.9101 730.7504 763.4263 825.0113 843.3286 875.1658 876.2737 908.6946 948.1485 964.9606 970.1967 988.0519 1020.9711 1066.5247 1071.6116 1077.7363 1087.8985 1120.0912 1126.7586 1148.8371 1202.2934 1237.6564 1251.5600 1257.1991 1281.5564 1293.2744 1316.5082 1354.1675 1360.0652 1376.8849 1388.2719 1389.5267 1396.4058 1450.5407 1456.3618 1467.0272 1467.8758 1468.3328 1475.0353 1476.5580 1483.3818 1487.1907 1490.4419 1609.2107 1663.5131 2957.8124 2965.3565 2970.0392 2970.3706 2972.6362 2988.5957 2997.3326 2997.8936 3024.1194 3035.4060 3042.1553 3042.5647 3067.7277 3072.3393 3072.4518 3092.9593 3124.4901 3143.4121
redmass: 3.7744 1.8097 3.5664 4.0596 1.1312 2.5081 1.6969 1.9723 3.4705 1.3549 4.0799 1.1199 4.0182 3.2074 3.5772 3.5906 3.4315 3.0257 2.2878 3.6664 3.9253 7.1413 1.0683 1.1074 4.1232 1.1796 1.4678 3.0761 2.7520 1.5982 1.1626 3.4800 1.2330 3.6534 2.3207 2.0874 2.5167 1.7347 2.1665 2.5674 1.4793 1.4393 3.2135 1.3128 1.2123 1.1053 1.0853 1.3431 1.4908 1.5661 1.4717 1.3700 1.2488 1.2282 1.0682 1.0499 1.0817 1.0934 1.0784 1.0685 1.0428 1.0746 1.0465 1.0929 9.3312 5.8903 1.0587 1.0386 1.0384 1.0584 1.0372 1.0598 1.0569 1.0987 1.1026 1.0956 1.1041 1.0958 1.1032 1.1050 1.0993 1.0989 1.0975 1.0906
irintensity: 0.2462 0.2643 0.6578 2.6790 0.0063 0.0851 1.2586 0.9920 0.9373 0.0164 0.3628 0.0112 5.2171 3.9314 9.8211 2.0206 2.1670 8.7984 9.3153 0.0967 2.0095 3.6126 11.0675 0.0102 0.3733 1.0745 23.2560 0.5804 24.6123 11.0898 1.4691 46.2179 8.1371 10.9752 315.8224 11.7337 46.4568 7.3413 207.7051 16.9444 0.8310 0.5593 73.6937 8.8191 0.0658 0.3538 0.6001 0.1411 20.7100 17.6790 2.2762 49.0843 5.0657 23.9604 30.1040 6.9243 6.7151 32.7068 12.2502 2.3977 12.7015 0.2567 28.7685 23.7086 154.5492 186.2720 7.2784 8.2659 59.2707 53.6181 30.5958 13.9520 51.5845 1.4004 14.9095 6.2335 11.8724 27.3170 5.1142 154.3551 54.4142 24.9369 1.8349 7.6907
temp: 298.150 k
press: 1.00000 atm
elementType: 8 8 6 6 6 6 6 6 6 6 6 6 1 1 1 1 1 1 1 1 1 1 1 1 1 1 1 1 1 1
symmnumber: 1
zpe: 680933.6 jmol-1
zpe.correction: 0.259354 hartree
zpe.thermalcorrener: 0.274801 hartree
zpe.thermalcorrenthalpy: 0.275745 hartree
zpe.thermalcorrgfe: 0.215041 hartree
zpe.sumelectzpe: -541.336554 hartree
zpe.sumelectthermal: -541.321107 hartree
zpe.sumelectthermalent: -541.320163 hartree
zpe.sumelectthermalfe: -541.380868 hartree
dipole: 0.5118 -1.5838 0.0092
dipole: 1.6645
quadrupole: -57.3266 -78.3866 -74.2534
quadrupole: -4.5710 0.1417 0.0156
quadrupole: 12.6623 -8.3977 -4.2646 -4.5710 0.1417 0.0156
hfenergy: -541.5959082 hartree
pointgroup: C01 [X(C10H18O2)]
dipole: 0.2010671 0.6186225 0.0756233 debye
polarizability: 184.6353458|1.8925596|105.1825408|-1.887392|3.2951145|81.9697697 unknown
InChI: InChI=1S/C10H18O2/c1-4-5-6-7-12-10(11)8-9(2)3/h8H,4-7H2,1-3H3
charge 0 multiplicity 1
30 atoms
O  0.113906 0.363798 -0.022715
O  1.364121 -1.581455 -0.332548
C  -3.660046 -0.265977 -0.074345
C  -2.311361 0.487935 -0.004564
C  -4.878622 0.681155 0.015663
C  -1.120629 -0.465759 -0.10654
C  -6.226777 -0.067662 -0.054527
C  1.331358 -0.333662 -0.154422
C  3.786132 0.331991 -0.125287
C  2.448734 0.625764 -0.047102
C  4.81018 1.442853 0.011935
C  4.355146 -1.053579 -0.345499
H  -3.715452 -1.009629 0.747858
H  -3.717055 -0.842941 -1.0210
H  -2.244805 1.052222 0.94574
H  -2.252443 1.23019 -0.824003
H  -4.82204 1.257704 0.96135
H  -4.822505 1.424182 -0.80563
H  -1.110224 -1.022366 -1.0626
H  -1.105916 -1.204864 0.716785
H  -6.322192 -0.624991 -1.005555
H  -6.318815 -0.797591 0.771881
H  -7.081145 0.630403 0.014843
H  2.132932 1.662902 0.111546
H  5.480858 1.24674 0.871624
H  4.342103 2.431145 0.154356
H  5.457562 1.48768 -0.885786
H  3.569264 -1.818916 -0.409914
H  5.051645 -1.311573 0.476728
H  4.954285 -1.070497 -1.277771
