program: Gaussian 09
title: 000092563
version: EM64L-G09RevD.01
frameworkgroup: C1[X(C11H18O)]
method: RPBEPBE
basis: SDD
operation: Freq
keyword: #pfreq=noraman
keyword: PBEPBE/SDD
title: #p freq=noraman PBEPBE/SDD
converged: YES YES NO YES
title: Mulliken charges:
elementType: O C C C C C C C C C C C H H H H H H H H H H H H H H H H H H
charge: -0.452844 -0.270644 -0.110301 -0.074302 -0.181247 -0.538545 -0.006962 -0.519865 -0.518228 -0.514931 -0.416176 -0.441284 0.233657 0.227833 0.219208 0.234651 0.217991 0.223893 0.231038 0.209110 0.241557 0.209786 0.220254 0.220965 0.211045 0.212784 0.199679 0.195796 0.195246 0.340836
chargesum: 0.00000
title: Mulliken charges with hydrogens summed into heavy atoms:
elementType: O C C C C C C C C C C C
charge: -0.112008 -0.036987 0.117532 0.144906 0.053404 -0.096661 0.224076 -0.069198 -0.088188 -0.082921 -0.003712 -0.050243
polarizability: 1.35423175e+02 3.73774862e-01 1.04212094e+02 1.39767972e+00 -1.33856801e+00 9.58592386e+01
1716.lowfreq: -27.6774 -13.6678 -2.1541 -0.0001 0.0006 0.0007 76.4425 95.7007 149.7235
frequency: 76.4221 95.6501 149.7139 178.7021 196.0139 280.1272 285.0619 307.0910 320.9863 391.1438 463.7860 498.2618 536.3242 583.1185 652.9074 711.6997 756.0105 782.7563 823.0995 848.4798 862.8548 886.4653 896.2712 907.7356 916.5928 920.2076 946.9074 961.4815 976.6571 993.5212 1011.5993 1022.0329 1039.7925 1048.9260 1053.1705 1067.7743 1094.7218 1111.6935 1129.6734 1145.1844 1155.6828 1160.6512 1181.6774 1202.8891 1206.9098 1223.4597 1231.8368 1256.4726 1261.0358 1266.1962 1274.1526 1284.4118 1285.0033 1288.3364 1302.8433 1306.3328 1321.8931 1329.3631 1346.5537 1406.1782 1465.1776 1467.1192 1470.5469 1473.2956 1481.2933 1494.7030 2923.1414 2971.0168 2979.5947 2980.6349 2984.5135 2989.7242 3005.0113 3007.9196 3008.7252 3011.5586 3033.9080 3045.8473 3048.8242 3052.3272 3061.7760 3069.6341 3073.8355 3562.4758
redmass: 4.3412 2.9056 2.7376 2.4472 2.3809 1.1134 2.8203 3.1327 2.7633 2.5343 2.2158 2.2564 2.0919 2.8845 2.3313 3.6980 3.4459 3.1270 2.6864 1.9986 2.0495 1.6618 1.9901 2.3966 1.9331 2.8293 2.1030 2.9575 1.9689 1.8078 1.6234 1.4338 1.7503 1.7619 1.3738 1.6818 1.7433 1.5418 1.6648 1.3053 1.5074 1.5225 1.5212 1.5252 1.4604 1.3945 1.3651 1.3387 1.3953 1.4502 1.3868 1.3893 1.3560 1.4615 1.3350 1.4915 1.4532 1.5121 1.4487 1.4374 1.0868 1.0873 1.0829 1.0943 1.0892 1.0923 1.0541 1.1033 1.0632 1.0609 1.0665 1.0847 1.0741 1.0680 1.0712 1.0836 1.0870 1.0968 1.1005 1.0911 1.1043 1.1035 1.1046 1.0665
irintensity: 1.0721 3.4891 2.2999 6.8726 4.5783 139.8200 3.5270 2.8719 0.2836 2.3676 5.8848 5.0348 1.8228 1.0224 2.5773 3.7377 2.5037 2.9846 2.3825 1.2119 4.3704 1.0847 3.7285 1.2485 1.7641 3.9435 29.2780 41.2648 9.8421 3.6649 1.9636 11.3755 1.9087 0.0145 0.3240 23.0459 0.3709 0.2387 1.8809 3.9503 0.9062 0.2786 3.4173 4.6091 14.0885 1.4677 1.9286 7.9300 3.7820 0.4626 4.7004 0.0335 0.8394 6.5336 1.3482 0.8285 3.1719 1.4128 0.1851 2.2277 1.8280 7.0614 7.3822 2.3116 17.3151 18.5702 61.4645 36.7813 41.0640 23.1136 37.9596 0.6972 39.1918 29.9360 1.8234 90.0745 92.8661 57.3010 41.2137 22.4944 62.2263 69.0146 44.2193 1.6018
temp: 298.150 k
press: 1.00000 atm
elementType: 8 6 6 6 6 6 6 6 6 6 6 6 1 1 1 1 1 1 1 1 1 1 1 1 1 1 1 1 1 1
symmnumber: 1
zpe: 705109.5 jmol-1
zpe.correction: 0.268562 hartree
zpe.thermalcorrener: 0.279207 hartree
zpe.thermalcorrenthalpy: 0.280151 hartree
zpe.thermalcorrgfe: 0.232708 hartree
zpe.sumelectzpe: -504.225263 hartree
zpe.sumelectthermal: -504.214619 hartree
zpe.sumelectthermalent: -504.213675 hartree
zpe.sumelectthermalfe: -504.261117 hartree
dipole: 0.2250 -0.9581 1.3120
dipole: 1.6401
quadrupole: -69.5422 -74.0169 -74.6137
quadrupole: -3.9427 6.1358 0.1019
quadrupole: 3.1821 -1.2926 -1.8894 -3.9427 6.1358 0.1019
hfenergy: -504.4938255 hartree
pointgroup: C01 [X(C11H18O1)]
dipole: -0.0868815 -0.3744819 -0.5182519 debye
polarizability: 135.4314448|-0.1712524|104.1923151|1.3194585|1.3972834|95.8707471 unknown
InChI: InChI=1S/C11H18O/c12-6-8-4-7-5-11(8)10-3-1-2-9(7)10/h7-12H,1-6H2
charge 0 multiplicity 1
30 atoms
O  -3.986285 -0.099497 0.553835
C  -0.356846 -0.88654 -0.433452
C  0.892729 -0.774153 0.495068
C  1.165656 0.791619 0.533733
C  0.044171 1.362943 -0.388155
C  -0.088996 0.249205 -1.468126
C  -1.584847 -0.325549 0.359029
C  -1.319096 1.227353 0.353203
C  2.204293 -1.418616 -0.038978
C  2.626559 0.978187 0.031078
C  3.313749 -0.387169 0.296266
C  -2.926342 -0.712598 -0.26962
H  -0.511592 -1.900075 -0.845421
H  0.6623 -1.169302 1.502728
H  1.062879 1.193586 1.559488
H  0.252681 2.380402 -0.761759
H  -0.929239 0.422307 -2.164578
H  0.828639 0.093693 -2.061943
H  -1.585646 -0.720816 1.392965
H  -1.286173 1.648964 1.373064
H  -2.125796 1.751284 -0.191037
H  2.14446 -1.554213 -1.137276
H  2.396707 -2.412945 0.403322
H  3.140388 1.819771 0.529834
H  2.630302 1.190285 -1.056714
H  4.23367 -0.532367 -0.299524
H  3.592571 -0.467906 1.365545
H  -3.033257 -1.819733 -0.279276
H  -2.98523 -0.344288 -1.317811
H  -4.871708 -0.331832 0.176013
