program: Gaussian 09
title: 000092549
version: EM64L-G09RevD.01
frameworkgroup: C1[X(C9H12O3)]
method: RPBEPBE
basis: SDD
operation: Freq
keyword: #pfreq=noraman
keyword: PBEPBE/SDD
title: #p freq=noraman PBEPBE/SDD
converged: YES YES NO NO
title: Mulliken charges:
elementType: O O O C C C C C C C C C H H H H H H H H H H H H
charge: -0.265884 -0.204419 -0.242065 -0.532614 -0.506727 0.414507 0.256973 -0.404053 -0.346323 -0.227360 -0.168431 -0.672099 0.237610 0.229827 0.260411 0.249261 0.259119 0.274092 0.228105 0.228174 0.259876 0.212014 0.229696 0.230311
chargesum: 0.00000
title: Mulliken charges with hydrogens summed into heavy atoms:
elementType: O O O C C C C C C C C C
charge: -0.265884 -0.204419 -0.242065 -0.065177 0.002944 0.414507 0.256973 -0.144934 -0.072232 0.228919 0.091445 -0.000078
polarizability: 1.36207890e+02 -2.73415272e+00 9.60534004e+01 6.38959044e+00 6.46847361e+00 7.39524793e+01
1716.lowfreq: -21.6239 -7.9042 -5.8098 -2.7450 -0.0009 -0.0009 -0.0006 33.8474 49.5528
frequency: -11.6058 33.5676 49.5190 55.7385 65.6161 144.0040 153.4002 215.7975 249.3592 292.4930 300.5468 358.4284 444.8040 553.5220 588.5176 623.5245 637.2329 717.1030 731.9757 767.8614 781.6790 797.5909 818.4296 849.1612 856.1203 916.8880 961.5923 988.5160 1008.3905 1019.9214 1038.9855 1061.6262 1112.2805 1123.8578 1135.7807 1139.2319 1154.4925 1220.6820 1244.1161 1247.7811 1272.4217 1285.3020 1349.5872 1365.6794 1383.7707 1400.7881 1441.7241 1463.3828 1468.6111 1474.0470 1477.9367 1486.9873 1588.4383 1637.8584 2995.5946 2995.9856 3005.2208 3009.1407 3049.6494 3067.3764 3074.8960 3092.1849 3107.1399 3211.0140 3252.9480 3267.4371
redmass: 3.7453 4.1202 3.2233 3.1665 2.7389 2.8599 2.7328 5.3189 1.2984 4.7068 2.8430 3.7351 3.6794 2.7391 3.8817 4.2207 3.2977 1.3667 2.7888 1.4496 1.5677 1.1003 3.4943 5.8418 1.3728 5.5142 3.1591 3.1973 2.0776 2.3390 2.7139 3.6411 2.2808 2.0796 1.4781 2.1268 1.3997 1.2520 1.6753 1.1375 1.2729 1.4016 1.3965 1.6421 3.4496 1.2667 1.0843 1.0403 1.1083 1.0596 4.2245 1.0693 6.1423 9.7174 1.0382 1.0615 1.0618 1.0582 1.0965 1.1066 1.1000 1.0985 1.1025 1.0937 1.0989 1.1073
irintensity: 0.3066 0.4521 0.2760 0.3436 0.2230 3.0370 5.4148 5.7291 1.3090 8.5255 4.7721 4.8549 5.4384 2.1452 15.1807 16.2958 9.8958 9.0722 17.0289 35.2379 58.7912 3.0918 9.1211 26.3216 7.3426 15.2015 4.2199 29.0714 1.3514 39.4180 4.4382 64.5461 29.4998 186.8808 10.1720 81.2674 71.1701 0.8619 0.1995 0.1148 34.8761 60.8048 10.6991 22.3758 6.1093 18.3903 24.2002 12.0571 15.2350 5.0430 8.8644 13.8077 2.7565 174.1985 16.9899 9.3321 18.9118 22.8796 0.1204 7.9293 21.6567 30.5436 45.3010 1.3823 0.2480 0.4675
temp: 298.150 k
press: 1.00000 atm
elementType: 8 8 8 6 6 6 6 6 6 6 6 6 1 1 1 1 1 1 1 1 1 1 1 1
symmnumber: 1
zpe: 506530.3 jmol-1
zpe.correction: 0.192927 hartree
zpe.thermalcorrener: 0.204689 hartree
zpe.thermalcorrenthalpy: 0.205634 hartree
zpe.thermalcorrgfe: 0.152955 hartree
zpe.sumelectzpe: -574.888952 hartree
zpe.sumelectthermal: -574.877189 hartree
zpe.sumelectthermalent: -574.876245 hartree
zpe.sumelectthermalfe: -574.928924 hartree
dipole: -1.7889 -1.8494 -0.0358
dipole: 2.5732
quadrupole: -66.0342 -73.0636 -70.3325
quadrupole: 0.9229 -2.6170 5.0481
quadrupole: 3.7759 -3.2535 -0.5224 0.9229 -2.6170 5.0481
hfenergy: -575.0818789 hartree
pointgroup: C01 [X(C9H12O3)]
dipole: -0.6977155 0.7295324 0.0769273 debye
dipolederiv: -1.6246027 0.4290551 -0.0627904 0.5099443 -0.7057475 0.0699411 -0.0690649 0.0689618 -0.2919986 -0.7422697 -0.0043225 0.2127783 -0.0811061 -0.2348706 -0.085675 0.2369788 -0.0834481 -0.2942309 -0.7105978 -0.1407864 0.0254359 0.2381091 -0.9317667 0.1216075 -0.035988 0.1164131 -0.3215118 0.1128381 0.0066002 -0.00094 -0.0150345 0.0986795 0.0025771 0.0000388 -0.0065415 0.15067 -0.3266462 -0.0792994 0.0309584 -0.2239126 -0.069555 0.0656049 0.1310735 0.0755508 0.1132746 0.1499818 0.0891441 -0.0253896 0.2055521 0.0138223 0.0310542 -0.0100264 0.0474241 -0.041259 1.6498936 -0.1512252 -0.0103551 -0.5948221 1.3279679 -0.2128591 0.0272153 -0.2073261 0.2206775 -0.226382 0.0261706 0.0060892 -0.0233931 -0.0786241 0.1198392 -0.025236 0.0909706 -0.1259075 0.3122667 0.0615761 -0.159194 0.0900742 -0.0413698 0.0554114 -0.169394 0.0732251 -0.0581094 0.9055542 -0.141419 0.0190079 0.0327185 0.2423522 0.0187678 -0.0005445 0.0165151 0.3476174 0.1688848 -0.0548155 -0.2028828 -0.0528073 0.0139215 0.1573495 -0.194045 0.1531782 0.0718796 -0.0831563 0.0920459 -0.0151585 0.072735 -0.0237505 0.0143585 -0.0120975 0.0143814 0.0584702 0.0556531 -0.0013758 0.0067061 -0.004691 -0.0540449 -0.0678885 -0.0239498 -0.0979642 0.0331337 0.0134205 -0.0253208 0.0388802 0.0000351 0.0683706 0.0341656 0.0393383 0.0649039 -0.1025606 0.0593933 -0.0021819 0.0134413 0.0212493 0.0867981 0.0322524 -0.0189468 0.0535593 -0.0638363 0.0725431 -0.0005648 -0.0072923 0.0238067 -0.0423778 -0.0671621 -0.0263175 -0.0942964 0.05444 0.1124434 0.0414295 0.0776914 0.0269666 0.0860661 -0.089751 0.0719552 -0.0917577 0.0853641 0.1069056 -0.0281197 0.0360636 -0.0378279 0.079673 -0.0945189 0.0300048 -0.0982473 0.1306506 -0.0506106 0.0352098 0.0033974 -0.0589896 -0.0331904 -0.0982353 -0.0248933 -0.104011 -0.0265193 -0.0530809 0.0337432 -0.0143042 -0.0464422 0.0315685 0.0780796 0.0417032 0.0835029 -0.092982 0.0450454 -0.0848125 0.0111037 -0.068113 0.096529 -0.0707686 0.0303563 -0.0612241 0.1616895 -0.1720532 -0.0341404 0.0077222 -0.0548239 0.0611381 0.009968 0.0107872 0.009533 0.1136309 0.1120425 -0.0426402 -0.0453184 0.0154309 -0.0315485 -0.1016646 -0.0278742 -0.1206502 -0.0252005 0.1125334 -0.0239506 0.0543495 0.0253415 0.039959 0.0775464 0.0189264 0.097347 -0.0973822 unknown
polarizability: 136.3310609|2.8867192|94.6266237|-5.6874724|8.4529902|75.2560855 unknown
InChI: InChI=1S/C9H12O3/c1-2-12-9(10)4-3-8-5-6-11-7-8/h5-7H,2-4H2,1H3
charge 0 multiplicity 1
24 atoms
O  -2.798129 0.491929 -0.14539
O  4.214478 0.092152 -0.611284
O  -2.078403 -1.695152 0.217643
C  0.689511 -0.851891 0.307118
C  -0.428205 0.118406 -0.145898
C  2.067107 -0.260994 0.124817
C  -1.814205 -0.488946 0.00327
C  2.612514 0.913419 0.792523
C  3.069147 -0.722998 -0.712457
C  -4.216612 0.020039 -0.05823
C  3.901257 1.092715 0.326034
C  -5.1015 1.244133 -0.267763
H  0.596176 -1.795741 -0.258013
H  0.523036 -1.114237 1.369354
H  -0.285109 0.39465 -1.208912
H  -0.395347 1.068409 0.417728
H  2.107218 1.534027 1.531491
H  3.148065 -1.558718 -1.402119
H  -4.372653 -0.755008 -0.830462
H  -4.364527 -0.448139 0.931812
H  4.690422 1.811742 0.525516
H  -6.165679 0.950585 -0.21189
H  -4.910443 2.006799 0.506413
H  -4.918219 1.69882 -1.256301
