program: Gaussian 09
title: 000092539
version: EM64L-G09RevD.01
frameworkgroup: C1[X(C7H9NO4)]
method: RPBEPBE
basis: SDD
operation: Freq
keyword: #pfreq=noraman
keyword: PBEPBE/SDD
title: #p freq=noraman PBEPBE/SDD
converged: YES YES NO NO
title: Mulliken charges:
elementType: O O O O N C C C C C C C H H H H H H H H H
charge: -0.207261 -0.408417 -0.217044 -0.240881 -0.213192 -0.151673 -0.466747 -0.526121 0.200415 0.199227 0.271035 -0.745668 0.315543 0.252364 0.252052 0.267335 0.264188 0.254625 0.248361 0.266912 0.384946
chargesum: 0.00000
title: Mulliken charges with hydrogens summed into heavy atoms:
elementType: O O O O N C C C C C C C
charge: -0.207261 -0.023471 -0.217044 -0.240881 -0.213192 0.163870 0.037669 0.005402 0.200415 0.199227 0.271035 0.024230
polarizability: 1.02221532e+02 3.63339851e+00 9.72908601e+01 7.61980014e+00 2.63683839e+00 7.09007216e+01
1716.lowfreq: -15.4398 -4.9936 0.0007 0.0010 0.0011 5.9936 46.8044 62.9878 84.4033
frequency: 46.6740 62.9402 84.4025 101.1321 128.6216 154.8207 202.6421 245.7750 315.4504 353.7096 373.8904 389.7997 520.3849 557.3727 565.2666 575.2295 613.7246 623.0059 644.4482 708.4124 771.7740 821.5768 862.1766 944.0491 970.9130 983.7490 1035.3132 1040.2957 1043.2738 1057.9972 1127.3168 1149.3636 1180.9287 1223.9026 1249.0104 1268.3715 1285.7567 1294.7228 1325.2013 1366.6674 1391.2249 1431.3444 1446.0833 1448.0373 1479.2404 1611.0087 1663.2182 1671.5808 3009.0640 3018.0081 3033.9282 3089.3530 3094.9458 3097.3204 3109.4875 3137.7237 3519.0264
redmass: 7.8714 6.7684 4.2545 10.3873 2.5255 1.0841 3.5549 3.2914 6.5454 4.4020 8.7846 5.0477 2.4083 3.5804 4.2803 2.2184 2.2830 3.4932 2.9868 4.5001 2.6108 4.6959 2.0848 3.1674 1.9776 3.6427 2.1780 1.8118 2.1985 2.0797 3.0974 1.2741 1.7226 1.8000 1.7400 2.0341 2.7114 1.6883 1.6073 1.7263 1.2347 1.0872 1.0831 1.0464 1.0878 8.3124 11.7776 8.9368 1.0365 1.0651 1.0633 1.0867 1.0957 1.0983 1.1031 1.1025 1.0642
irintensity: 1.4364 1.2092 7.2444 2.0013 2.8443 0.5293 7.9783 3.5616 0.6118 4.6503 0.3287 8.5839 4.3334 42.1663 49.7920 36.2375 21.4039 10.8862 46.5738 33.8761 7.4447 10.1894 15.4903 13.9085 17.7543 0.5476 29.8201 16.1861 88.2758 214.2400 18.8524 9.8240 55.6957 35.0702 25.2489 40.4327 313.4641 57.7524 61.5261 63.1560 57.8172 32.5117 12.7905 17.0310 7.7667 136.0338 268.6015 212.0385 1.0514 5.1953 19.4331 3.1140 3.8527 6.5019 14.4450 12.6444 34.6395
temp: 298.150 k
press: 1.00000 atm
elementType: 8 8 8 8 7 6 6 6 6 6 6 6 1 1 1 1 1 1 1 1 1
symmnumber: 1
zpe: 415825.9 jmol-1
zpe.correction: 0.158380 hartree
zpe.thermalcorrener: 0.170090 hartree
zpe.thermalcorrenthalpy: 0.171034 hartree
zpe.thermalcorrgfe: 0.119854 hartree
zpe.sumelectzpe: -626.915484 hartree
zpe.sumelectthermal: -626.903774 hartree
zpe.sumelectthermalent: -626.902830 hartree
zpe.sumelectthermalfe: -626.954010 hartree
dipole: -2.4838 2.3831 -1.5359
dipole: 3.7693
quadrupole: -64.0602 -72.5517 -72.3014
quadrupole: -5.3958 -3.3708 -4.9078
quadrupole: 5.5776 -2.9139 -2.6637 -5.3958 -3.3708 -4.9078
hfenergy: -627.0738638 hartree
pointgroup: C01[X(C7H9N1O4)]
dipole: 0.9816004 -0.7815583 -0.7904318 debye
dipolederiv: -0.9301329 -0.3334874 0.2497489 -0.0941516 -0.6751642 0.0575158 0.2562287 0.1832933 -0.404658 -1.0852053 -0.3067305 0.3696143 -0.2902752 -0.5117594 0.1610444 0.2414327 0.1207229 -0.3713154 -0.5972497 -0.1421873 -0.0487449 -0.1180511 -0.3386101 -0.0150081 0.1311402 0.0358994 -0.901499 -0.606808 -0.1654606 0.0932 0.0306627 -1.0547456 0.0740761 0.066899 0.1258319 -0.3645647 -0.7244307 0.3104631 0.1138246 0.0613562 -1.7465758 0.1106094 0.19859 -0.002169 -0.2843086 0.4065312 -0.0065323 -0.0521962 -0.1160943 0.02374 -0.0953015 -0.1694532 -0.086306 0.0972818 0.0507978 -0.0350958 0.0026542 0.0664476 0.0690926 0.0608639 -0.0173294 0.0191977 0.1124244 -0.2110027 0.1916188 0.0963886 0.2065299 -0.159557 -0.0328994 0.0672934 -0.0015272 0.048948 1.1026786 0.3239121 -0.3565182 0.2039325 1.5717458 -0.2058625 -0.345601 -0.3312015 0.335328 1.3060709 0.5660485 -0.1536624 0.4819091 0.4178448 -0.0687575 -0.1427994 -0.0348438 1.1453832 1.0051758 -0.4053091 -0.2330092 -0.2966258 1.705091 -0.0328996 -0.2480279 0.0674026 0.2905338 -0.3700252 0.0134729 0.1427838 -0.0797878 0.0174985 0.0322813 0.17745 0.0015521 -0.0567299 0.0373227 -0.0025442 -0.0054362 -0.0331026 0.0350183 0.0642784 0.0003142 0.0299931 0.0301266 -0.1135337 0.0522004 0.0229483 0.0330503 0.0837465 0.0122314 -0.0104471 0.0109171 0.090545 0.0746483 -0.0336082 -0.0708748 -0.0339471 0.0328576 -0.0334451 -0.0269241 -0.0292457 -0.1117876 0.0432834 0.0344539 -0.0440647 0.001351 0.1076588 0.0159497 -0.0272697 0.033364 -0.0379568 0.0662015 -0.07694 -0.0119294 -0.0531237 -0.0398076 -0.0474028 0.0105377 -0.07145 0.0818509 0.0654186 -0.026561 -0.0284633 -0.0558023 0.0648863 -0.0805399 -0.0531618 -0.0714675 0.0402529 0.061334 0.0412222 0.0162817 0.1104202 -0.0749929 -0.0192043 0.0079498 0.0035578 0.1213464 0.0935685 0.0196975 -0.0380033 0.0129411 0.1048734 0.0716105 -0.0162499 0.0505522 0.0012679 0.3253568 -0.018633 -0.0645417 -0.0376391 0.3671588 -0.02914 -0.1005722 -0.0540732 0.1375312 unknown
polarizability: 99.9623731|4.7140792|98.3270507|-9.7458511|-0.7672121|72.1236903 unknown
InChI: InChI=1S/C7H9NO4/c1-4(9)8-5(7(11)12)2-3-6(8)10/h5,11H,2-3H2,1H3
charge 0 multiplicity 1
21 atoms
O  -2.008626 -1.650599 0.680516
O  2.977685 1.092472 -0.199769
O  1.656054 0.516156 1.627236
O  -0.652741 2.321141 -0.238382
N  -0.524746 0.018834 -0.162486
C  0.855721 0.088013 -0.690716
C  1.163637 -1.389955 -1.093287
C  0.275678 -2.224599 -0.143478
C  -0.908909 -1.310061 0.186797
C  1.819614 0.587127 0.393074
C  -1.233626 1.238473 0.049881
C  -2.637849 1.159684 0.601959
H  0.915666 0.784649 -1.540002
H  2.237272 -1.620686 -1.013579
H  0.858254 -1.541873 -2.14269
H  0.791657 -2.464613 0.805122
H  -0.086222 -3.170151 -0.576224
H  -3.284109 0.521069 -0.0236
H  -3.041177 2.181775 0.654774
H  -2.638597 0.697622 1.604506
H  3.607364 1.405122 0.504849
