program: Gaussian 09
title: 000092573
version: EM64L-G09RevD.01
frameworkgroup: C1[X(C11H20O2)]
method: RPBEPBE
basis: SDD
operation: Freq
keyword: #pfreq=noraman
keyword: PBEPBE/SDD
title: #p freq=noraman PBEPBE/SDD
converged: YES YES NO NO
title: Mulliken charges:
elementType: O O C C C C C C C C C C C H H H H H H H H H H H H H H H H H H H H
charge: -0.263900 -0.252401 -0.349777 -0.502633 -0.341871 0.270835 -0.451905 -0.306422 -0.691907 -0.162475 -0.163942 -0.437820 -0.672670 0.223235 0.199744 0.242955 0.233193 0.193943 0.192370 0.202299 0.220311 0.237757 0.223130 0.211090 0.213235 0.215842 0.234532 0.219130 0.201698 0.212125 0.217732 0.223952 0.208615
chargesum: 0.00000
title: Mulliken charges with hydrogens summed into heavy atoms:
elementType: O O C C C C C C C C C C C
charge: -0.263900 -0.252401 0.073203 -0.026485 0.044443 0.270835 -0.029295 0.154466 -0.051740 0.072057 0.055188 -0.023997 -0.022372
polarizability: 1.35703804e+02 -1.20449083e+01 1.34609538e+02 -1.56568861e+00 -2.43890616e+00 1.06704382e+02
1716.lowfreq: -5.3777 -4.7583 -0.0006 -0.0005 -0.0002 5.8782 9.0848 23.8583 37.4796
frequency: 8.4138 23.6693 37.4363 52.9799 71.2308 75.1017 112.4168 115.9242 124.4961 150.7085 202.8286 225.7038 241.7613 268.6313 280.3695 338.7924 342.2933 396.6506 429.9359 468.8603 508.3538 565.9141 661.5455 726.9836 770.3105 775.7553 791.9248 808.5393 881.4875 893.9470 899.7444 906.9645 920.9815 967.7936 972.3898 1016.2214 1030.1389 1041.3131 1066.6749 1078.9036 1088.8849 1107.4681 1109.1481 1139.9045 1153.2525 1202.7938 1207.1897 1232.4070 1246.8987 1257.7903 1275.9267 1280.3631 1289.5875 1294.8306 1317.1998 1330.9430 1349.1782 1354.5504 1363.9921 1382.2638 1390.3688 1443.1444 1445.4009 1458.2917 1463.6946 1468.5346 1474.0391 1476.3118 1476.9757 1483.5671 1488.0638 1643.9759 1687.9883 2962.8549 2964.6851 2967.6527 2972.9315 2974.4454 2974.5929 2988.7620 3006.9574 3021.5948 3029.7379 3042.7418 3042.8694 3065.0329 3065.4270 3072.8755 3074.0463 3074.2381 3078.4070 3089.3479 3099.3170
redmass: 2.9897 2.6224 2.0987 4.5717 3.4995 3.1141 2.3332 2.7105 2.2864 2.6321 1.5615 1.1478 1.7856 2.3637 3.6302 3.2151 3.2116 2.4525 2.9881 2.7664 2.2513 3.1965 4.6423 1.1055 1.2531 2.3008 1.3532 1.9298 2.3750 2.0855 2.0040 2.0033 1.2973 1.9656 1.2539 2.2765 2.6478 2.5070 1.8310 2.0184 2.3137 2.0715 2.2587 2.5050 2.1700 1.3588 1.4339 1.2061 1.1779 1.3325 1.2102 1.2362 1.0749 1.2635 1.3628 1.4455 1.4019 1.4058 1.5979 1.2022 1.2196 1.0850 1.1023 1.0929 1.0734 1.0666 1.0451 1.0562 1.0530 1.0656 1.0823 9.2141 6.5187 1.0592 1.0634 1.0618 1.0624 1.0362 1.0389 1.0619 1.0985 1.0606 1.0965 1.0960 1.0947 1.0935 1.0984 1.1001 1.0990 1.0997 1.1010 1.0900 1.1077
irintensity: 0.0299 0.1350 0.6692 1.8747 0.4401 0.6283 0.9046 1.4808 0.4931 1.6864 0.7570 0.2218 3.0054 3.6987 1.1335 10.4462 6.1969 3.2448 2.4266 0.7705 4.8178 5.4832 5.0293 12.8921 8.2972 0.7848 0.3539 3.9339 13.1557 14.0849 1.4488 9.4022 4.1531 58.5255 24.5293 7.8209 11.1219 38.8025 5.0023 17.5889 102.3723 2.1432 3.0423 147.4644 19.3854 1.1223 3.8907 4.3776 1.0665 38.4566 7.1353 2.2669 1.1997 0.7669 1.9171 26.3743 0.4507 2.3522 11.8871 7.4690 15.1485 19.7386 10.7389 16.6381 8.0093 0.8688 10.2963 8.2180 6.9797 10.8203 19.3947 139.0717 0.3738 28.8886 39.1575 47.5360 10.0279 47.7999 7.5832 45.6756 11.5760 40.5981 6.5619 7.2404 21.5979 2.1991 1.1619 81.5924 36.5194 101.1821 56.3816 32.1583 26.4442
temp: 298.150 k
press: 1.00000 atm
elementType: 8 8 6 6 6 6 6 6 6 6 6 6 6 1 1 1 1 1 1 1 1 1 1 1 1 1 1 1 1 1 1 1 1
symmnumber: 1
zpe: 754888.7 jmol-1
zpe.correction: 0.287522 hartree
zpe.thermalcorrener: 0.304078 hartree
zpe.thermalcorrenthalpy: 0.305022 hartree
zpe.thermalcorrgfe: 0.239585 hartree
zpe.sumelectzpe: -580.548062 hartree
zpe.sumelectthermal: -580.531506 hartree
zpe.sumelectthermalent: -580.530561 hartree
zpe.sumelectthermalfe: -580.595998 hartree
dipole: 0.4653 0.1286 -1.5489
dipole: 1.6224
quadrupole: -76.6029 -75.9259 -84.6296
quadrupole: -2.9662 1.4614 0.4949
quadrupole: 2.4499 3.1269 -5.5768 -2.9662 1.4614 0.4949
hfenergy: -580.8355837 hartree
pointgroup: C01 [X(C11H20O2)]
dipole: 0.2066749 0.1122304 -0.5933929 debye
polarizability: 130.58041|-10.6521331|139.6481769|-3.2659713|3.3903249|106.7891376 unknown
InChI: InChI=1S/C11H20O2/c1-3-5-7-8-10-13-11(12)9-6-4-2/h5,7H,3-4,6,8-10H2,1-2H3
charge 0 multiplicity 1
33 atoms
O  0.143724 -1.678203 -0.937517
O  -0.437069 -1.109682 1.255937
C  -2.766267 0.352581 0.18531
C  -1.510922 0.03716 -0.655837
C  -3.621395 1.479589 -0.435636
C  -0.57515 -0.949866 0.021691
C  2.594643 -1.912354 -0.61673
C  1.217435 -2.585069 -0.439984
C  -4.892499 1.779765 0.387276
C  2.773175 -0.692968 0.264377
C  2.957579 0.571407 -0.19622
C  3.088484 1.805635 0.672162
C  1.942693 2.821886 0.423505
H  -2.454234 0.633356 1.208976
H  -3.380208 -0.56419 0.288847
H  -1.77361 -0.346183 -1.657602
H  -0.928746 0.968264 -0.821108
H  -3.907071 1.201288 -1.470787
H  -3.007419 2.400073 -0.518762
H  3.359953 -2.680437 -0.375102
H  2.729695 -1.64008 -1.68022
H  1.015727 -2.827694 0.618729
H  1.131785 -3.489591 -1.064707
H  -5.540028 0.885447 0.456172
H  -4.633341 2.08519 1.418352
H  -5.486414 2.593196 -0.068297
H  2.708876 -0.863219 1.350117
H  2.994106 0.739371 -1.285506
H  4.057536 2.305887 0.466498
H  3.099474 1.512181 1.739037
H  2.079877 3.732082 1.035839
H  0.965314 2.37578 0.683261
H  1.907697 3.1291 -0.638772
