program: Gaussian 09
title: 000092494
version: EM64L-G09RevD.01
frameworkgroup: C1[X(C7H6Cl2O2)]
method: RPBEPBE
basis: SDD
operation: Freq
keyword: #p
keyword: freq=noraman
keyword: PBEPBE/SDD
title: #p freq=noraman PBEPBE/SDD
converged: NO YES NO NO
title: Mulliken charges:
elementType: Cl Cl O O C C C C C C C H H H H H H
charge: -0.022952 -0.019064 -0.260440 -0.427383 0.499272 -0.190345 -0.199763 0.344492 -0.416812 -0.392200 -0.514487 0.254132 0.284508 0.229602 0.228061 0.241503 0.361876
chargesum: 0.00000
title: Mulliken charges with hydrogens summed into heavy atoms:
elementType: Cl Cl O O C C C C C C C
charge: -0.022952 -0.019064 -0.260440 -0.065507 0.499272 -0.190345 -0.199763 0.344492 -0.162680 -0.107692 0.184679
polarizability: 1.31654406e+02 -1.19667114e+00 1.25950864e+02 -2.33251804e+00 -2.39266680e-01 4.54852715e+01
1716.lowfreq: -7.7822 0.0020 0.0024 0.0032 6.6677 9.9709 57.4177 75.5159 143.9950
frequency: 57.3406 75.5082 143.9936 148.6510 180.8340 196.1798 226.4012 228.6941 292.6567 338.2307 348.3669 408.8597 425.0415 473.7001 506.8704 560.6329 595.6466 703.7664 738.7768 757.4576 819.0954 856.8662 903.3737 949.7233 1039.1586 1109.1487 1141.8162 1151.4280 1179.7437 1198.4738 1275.9869 1354.8704 1408.7286 1425.7475 1461.9140 1463.1893 1467.0399 1564.4224 1610.2617 2973.6697 3069.6746 3130.5725 3151.5937 3190.7866 3587.9989
redmass: 2.8927 6.1303 7.0118 1.0754 17.1922 4.7827 4.7049 8.5068 8.8826 1.1235 15.4100 7.5061 6.2744 7.8624 4.9356 5.8582 3.0261 5.8011 5.7068 10.8662 1.4935 1.4870 9.7019 9.0738 2.8289 1.2338 1.3916 1.3400 1.7411 1.8283 6.0901 5.2880 3.2342 1.5429 1.9248 1.0537 1.1703 7.6107 7.1427 1.0307 1.1054 1.1016 1.0927 1.0933 1.0663
irintensity: 6.0173 1.4480 2.7010 0.2304 0.3641 2.1413 2.7007 3.2194 3.0213 148.2677 2.7189 2.1395 12.1358 1.3106 2.3582 13.6560 14.4209 13.7844 22.5774 83.4690 28.8072 25.6855 85.0283 39.4121 3.7548 0.0158 217.2821 3.6181 9.0456 62.8730 15.3014 61.2421 62.7117 16.5178 119.3191 13.7946 7.6367 76.7056 92.7016 56.4878 28.7372 21.9465 3.0446 0.8891 53.1573
temp: 298.150 k
press: 1.00000 atm
elementType: 17 17 8 8 6 6 6 6 6 6 6 1 1 1 1 1 1
symmnumber: 1
zpe: 298425.8 jmol-1
zpe.correction: 0.113664 hartree
zpe.thermalcorrener: 0.124883 hartree
zpe.thermalcorrenthalpy: 0.125828 hartree
zpe.thermalcorrgfe: 0.075808 hartree
zpe.sumelectzpe: -1340.067163 hartree
zpe.sumelectthermal: -1340.055944 hartree
zpe.sumelectthermalent: -1340.055000 hartree
zpe.sumelectthermalfe: -1340.105019 hartree
dipole: -1.7649 1.2912 1.9847
dipole: 2.9532
quadrupole: -64.8814 -80.1266 -79.5948
quadrupole: -5.3079 4.2206 1.2018
quadrupole: 9.9862 -5.2590 -4.7272 -5.3079 4.2206 1.2018
hfenergy: -1340.1808277 hartree
pointgroup: C01 [X(C7H6Cl2O2)]
dipole: -0.6115337 0.6176047 0.7710447 debye
dipolederiv: -0.2406406 -0.2503573 0.0192058 -0.2575852 -0.6167795 0.0430523 0.0054266 0.0233184 -0.0504537 -0.2328709 0.2546067 0.0169221 0.2491042 -0.6185133 -0.0400416 0.0025577 -0.0213682 -0.0488752 -1.2577612 0.019378 -0.250019 0.0136913 -0.3258767 0.001916 -0.1224567 -0.0004303 -0.3587618 -1.5482787 0.0384493 0.0615615 0.034658 -0.1025807 -0.0057772 0.0943138 -0.0057654 -0.4319298 0.8398773 -0.0063023 0.0924137 -0.0249309 -0.4209772 0.0051271 -0.1324728 0.0063605 -0.0292928 0.3876826 0.1769094 -0.0678773 0.4224771 0.9587448 -0.0635643 -0.0356877 -0.0167253 -0.0318004 0.4114592 -0.2112448 -0.0707825 -0.4051056 0.9728115 0.0574652 -0.034384 0.0122394 -0.0494208 1.48228 -0.0686977 -0.0866388 -0.0582714 0.2144473 0.0069785 -0.1139111 0.0059368 0.1032446 -0.4675198 0.0070209 0.0052733 -0.3275256 -0.237453 0.0287588 0.0187982 -0.0030748 -0.1745081 -0.4278915 0.0267933 0.0076054 0.3271872 -0.2156821 -0.0294966 0.0171856 0.0009571 -0.132925 0.5558068 -0.0057033 0.2015886 -0.0102557 0.287176 -0.0020396 0.391423 -0.0043405 0.4490009 0.0144588 0.0665848 0.0110318 0.0688108 0.0106487 -0.0044288 0.0125255 -0.0041254 0.1854561 0.0799065 -0.0366301 0.0070246 -0.0416883 0.0420411 0.003643 0.0073122 0.0030434 0.1829558 0.0602369 -0.063731 0.0157765 0.0089534 -0.0647963 0.128452 -0.0762611 0.0751809 -0.0296786 0.0585332 0.0624605 0.014156 -0.008785 -0.0645073 -0.1304863 -0.0811145 -0.0746362 -0.0358854 -0.1460896 0.002663 0.0220561 0.0013022 0.117592 0.0001427 0.0507886 0.0003564 0.0606436 0.4308109 -0.0121996 0.0007023 0.0079636 0.0637047 0.0002989 -0.0040433 0.0030736 0.3922304 unknown
polarizability: 131.1579713|-2.0634397|126.4944114|-1.1954804|-0.1068928|45.4381593 unknown
InChI: InChI=1S/C7H6Cl2O2/c1-11-7-5(8)2-4(10)3-6(7)9/h2-3,10H,1H3
charge 0 multiplicity 1
17 atoms
Cl 0.9746 2.79482 -0.176298
Cl 0.94868 -2.771996 -0.163286
O  2.193279 0.00554 -0.38035
O  -3.424251 -0.050483 0.203059
C  0.81165 0.011889 -0.159384
C  0.074074 1.219763 -0.092975
C  0.059366 -1.191263 -0.086294
C  -2.028756 0.023395 0.087449
C  -1.327797 1.251352 0.025547
C  -1.338607 -1.209262 0.032943
C  3.026069 -0.015261 0.844769
H  -1.852632 2.211759 0.065756
H  -1.898401 -2.145706 0.080818
H  2.825203 -0.92773 1.436385
H  2.840914 0.8877 1.455961
H  4.065557 -0.020499 0.485825
H  -3.831848 0.850482 0.228077
