program: Gaussian 09
title: 000092544
version: EM64L-G09RevD.01
frameworkgroup: C1[X(C21H29N)]
method: RPBEPBE
basis: SDD
operation: Freq
keyword: #pfreq=noraman
keyword: PBEPBE/SDD
title: #p freq=noraman PBEPBE/SDD
converged: YES YES NO NO
title: Mulliken charges:
elementType: N C C C C C C C C C C C C C C C C C C C C C H H H H H H H H H H H H H H H H H H H H H H H H H H H H H
charge: -0.516990 -0.403816 -0.376936 -0.392075 -0.366583 -0.030199 -0.385754 -0.576067 -0.715870 -0.716436 0.520490 -0.425772 -0.404956 0.450021 -0.394231 -0.455532 0.458279 -0.447906 -0.386733 -0.197277 -0.218012 -0.267358 0.204373 0.203843 0.192437 0.191922 0.192819 0.192700 0.191207 0.191031 0.195987 0.208384 0.208760 0.204700 0.204100 0.209873 0.211476 0.212667 0.211515 0.212396 0.210052 0.230505 0.230695 0.262439 0.222167 0.293773 0.222956 0.264890 0.222821 0.222296 0.226928
chargesum: 0.00000
title: Mulliken charges with hydrogens summed into heavy atoms:
elementType: N C C C C C C C C C C C C C C C C C C C C C
charge: -0.223216 0.004400 0.007424 -0.006556 0.015654 0.165788 0.031390 -0.167268 -0.081852 -0.082472 0.520490 -0.195267 -0.174261 0.450021 -0.131792 -0.233364 0.458279 -0.224950 -0.121844 0.025544 0.004283 -0.040431
polarizability: 3.76460213e+02 -3.73226147e+01 2.19997109e+02 1.46450139e+01 1.83687775e+01 1.58817123e+02
1716.lowfreq: -9.9515 -0.0011 0.0008 0.0013 1.4523 2.8000 5.2211 13.2411 20.2194
frequency: -1.9281 12.7825 19.9174 40.9969 46.0227 53.8344 70.3544 75.0304 91.7654 102.3537 133.4649 138.1747 145.3407 190.4747 210.1992 223.3952 224.6426 242.0459 283.7945 293.7550 339.9779 350.0492 357.3406 369.3495 406.0767 412.5832 414.0893 428.5129 474.7715 505.2978 523.1847 553.3150 563.0009 612.2593 622.1915 645.6756 694.1466 718.5522 720.6332 734.4689 752.1847 771.5873 781.5967 789.2358 806.6664 821.1279 833.2137 846.1946 851.3949 871.3826 894.0494 914.0743 941.2979 942.6235 947.5020 958.2851 960.7033 968.5156 975.7691 981.8109 984.7433 1003.3485 1011.3077 1025.2800 1032.2348 1046.1164 1060.7001 1072.9011 1076.2742 1088.1590 1130.4268 1130.6254 1170.2688 1175.7565 1185.7979 1191.7674 1193.6605 1214.1857 1220.5905 1220.9255 1227.0551 1262.1925 1263.5188 1269.8399 1279.4122 1288.2729 1292.7030 1302.0729 1322.8701 1325.2040 1328.4994 1334.8478 1341.3033 1353.2021 1363.6501 1368.3773 1377.0038 1385.0942 1393.9733 1414.0453 1442.4037 1454.5721 1461.5160 1463.5321 1465.5085 1470.2782 1476.9547 1480.6921 1484.1860 1487.1263 1487.4630 1490.3420 1500.4983 1518.4520 1584.6363 1597.1429 1615.6060 1629.5327 2942.8112 2948.8447 2953.8361 2961.7119 2965.0955 2967.9176 2969.3359 2973.6741 2974.8962 2985.2451 2993.9564 3004.4595 3016.7978 3036.7504 3046.5413 3062.3955 3063.4774 3066.8861 3071.1114 3106.7529 3111.9734 3116.5542 3127.7148 3132.0082 3139.8995 3159.2571 3164.2828 3173.0787 3539.7619
redmass: 2.7006 4.1629 4.4545 3.3821 4.3239 3.3965 2.8335 2.1836 2.4435 3.5965 1.9790 1.9965 4.7828 3.5834 3.9299 2.3028 1.3770 1.0782 3.4980 4.2067 3.3940 2.0046 2.5186 2.6843 2.9021 3.0432 3.1052 2.8815 1.6184 2.6580 2.5540 2.5327 4.1240 5.9488 5.2676 6.1500 2.0562 3.6560 1.0710 1.1121 1.7801 1.2294 3.3962 3.2821 2.6899 1.2894 1.7064 1.5816 1.3279 4.7865 1.4458 1.1827 1.4011 1.3020 2.1944 1.3739 1.4841 1.3878 2.5606 2.9608 1.6166 2.9594 2.9025 2.1337 1.4661 3.0129 2.9510 1.3154 2.1833 1.5181 2.0073 1.2695 1.0505 1.8484 1.1057 1.1337 1.8877 1.2851 1.6759 1.8936 3.0414 1.4104 1.2646 1.5216 1.0601 1.1487 1.1007 1.4881 1.4670 1.4547 1.5868 1.4443 1.4239 1.6292 1.4722 2.9088 1.2209 6.9255 1.2228 3.6680 2.5255 1.0758 1.0758 1.0718 1.0451 1.0960 1.0542 1.0998 1.0505 1.9128 1.1804 1.0598 2.1631 3.0380 6.3263 3.8960 6.2202 6.5089 1.0649 1.0593 1.0593 1.0721 1.0591 1.0364 1.0580 1.0416 1.0581 1.0970 1.0993 1.1014 1.1033 1.1050 1.1047 1.1000 1.0998 1.0991 1.0986 1.0868 1.0875 1.0895 1.0865 1.0965 1.0931 1.0949 1.0961 1.0973 1.0753
irintensity: 0.0487 0.0455 0.1786 0.0482 1.0283 0.0129 0.2668 0.1397 0.0545 0.1101 0.0576 0.0462 2.2007 0.6188 5.0780 0.7618 0.3122 0.2945 4.1798 1.2696 1.0095 0.0023 0.1085 5.4344 2.0217 0.4008 0.9851 15.7366 134.3167 24.9855 2.4613 5.0784 3.4604 0.9853 5.0566 2.2925 37.6448 3.3503 9.9699 0.0132 88.6216 2.1309 1.1672 2.8036 26.1943 7.9391 9.3878 27.5083 2.5088 2.2727 3.8470 2.1237 0.2067 0.1135 0.7302 0.6018 0.0349 0.8215 1.6296 2.3836 2.3093 0.0650 6.0002 8.1198 0.0581 1.3769 1.9520 1.1216 0.1730 8.9168 0.7473 13.7718 0.8225 2.9496 13.7691 3.5700 6.8399 28.0593 1.7139 3.3867 5.5599 1.9888 1.0227 10.5866 0.7826 0.2498 0.2128 3.8662 45.2314 1.6497 69.1480 2.8005 1.6458 0.1623 3.0019 101.0100 22.1630 15.6191 17.8020 1.0717 4.8372 2.8228 0.2763 0.3755 1.7580 0.1717 2.2065 0.7474 22.6567 79.0339 28.5102 23.1263 8.9575 522.2071 7.0593 29.2520 290.0723 17.6863 14.0623 2.2920 18.5262 43.4381 2.8194 43.5021 39.7579 7.0788 157.6691 0.0652 11.9907 0.0295 0.7639 19.8295 163.0645 30.7787 7.2471 78.1188 109.4055 21.7206 13.5302 26.6714 2.8151 23.6828 31.1078 40.5565 4.6313 8.0460 16.1230
temp: 298.150 k
press: 1.00000 atm
elementType: 7 6 6 6 6 6 6 6 6 6 6 6 6 6 6 6 6 6 6 6 6 6 1 1 1 1 1 1 1 1 1 1 1 1 1 1 1 1 1 1 1 1 1 1 1 1 1 1 1 1 1
symmnumber: 1
zpe: 1167966.3 jmol-1
zpe.correction: 0.444855 hartree
zpe.thermalcorrener: 0.467116 hartree
zpe.thermalcorrenthalpy: 0.468060 hartree
zpe.thermalcorrgfe: 0.390456 hartree
zpe.sumelectzpe: -870.739301 hartree
zpe.sumelectthermal: -870.717040 hartree
zpe.sumelectthermalent: -870.716096 hartree
zpe.sumelectthermalfe: -870.793700 hartree
dipole: 0.3882 -0.7593 -0.4622
dipole: 0.9700
quadrupole: -127.7678 -127.9308 -138.2022
quadrupole: 5.0973 2.7844 6.2983
quadrupole: 3.5325 3.3695 -6.9020 5.0973 2.7844 6.2983
hfenergy: -871.1841563 hartree
pointgroup: C01 [X(C21H29N1)]
dipole: -0.1536132 -0.281927 0.2062712 debye
polarizability: 376.7646644|37.7960966|216.2299013|11.2045|-23.2778578|162.2798799 unknown
InChI: InChI=1S/C21H29N/c1-18(2)10-6-3-4-7-11-19-14-16-21(17-15-19)22-20-12-8-5-9-13-20/h5,8-9,12-18,22H,3-4,6-7,10-11H2,1-2H3
charge 0 multiplicity 1
51 atoms
N  4.367301 -0.935564 0.514375
C  -6.050055 0.20321 -0.035252
C  -4.551918 0.341686 0.322131
C  -6.935183 1.218086 0.726192
C  -3.647703 -0.656711 -0.435135
C  -8.462644 1.147467 0.435461
C  -2.15055 -0.513369 -0.082448
C  -1.250262 -1.519906 -0.852917
C  -8.794891 1.471358 -1.041731
C  -9.077877 -0.209932 0.855932
C  0.225947 -1.373443 -0.51907
C  1.061049 -0.484504 -1.243097
C  0.815084 -2.093925 0.551826
C  2.997537 -1.023015 0.166097
C  2.422566 -0.308846 -0.921667
C  2.169622 -1.921064 0.897037
C  5.290447 0.106644 0.275369
C  6.681457 -0.199832 0.328918
C  4.897137 1.455157 0.040905
C  7.647673 0.809745 0.149296
C  5.875062 2.454117 -0.148962
C  7.254578 2.145996 -0.100635
H  -6.379759 -0.830949 0.19108
H  -6.171807 0.340465 -1.128603
H  -4.421308 0.199696 1.41549
H  -4.217877 1.3776 0.102906
H  -6.777196 1.076387 1.816314
H  -6.578576 2.24327 0.490923
H  -3.979423 -1.693157 -0.213715
H  -3.781609 -0.51604 -1.528544
H  -8.936674 1.933884 1.061558
H  -2.007035 -0.658869 1.007449
H  -1.811168 0.518644 -0.304987
H  -1.409998 -1.371452 -1.939655
H  -1.592584 -2.547861 -0.619204
H  -9.888862 1.52174 -1.197757
H  -8.362065 2.44322 -1.345615
H  -8.397469 0.695239 -1.722109
H  -8.835823 -0.450607 1.908586
H  -8.700112 -1.035076 0.223798
H  -10.179324 -0.19198 0.7557
H  0.642444 0.070121 -2.092681
H  0.201784 -2.798007 1.128115
H  3.04526 0.345548 -1.538005
H  2.595144 -2.481096 1.739805
H  4.742767 -1.745484 1.010594
H  6.998418 -1.236188 0.503334
H  3.83804 1.726505 0.045852
H  8.711418 0.549749 0.195338
H  5.552214 3.487312 -0.322195
H  8.005704 2.928733 -0.248499
