program: Gaussian 09
title: 000092519
version: EM64L-G09RevD.01
frameworkgroup: C1[X(C16H18O)]
method: RPBEPBE
basis: SDD
operation: Freq
keyword: #pfreq=noraman
keyword: PBEPBE/SDD
title: #p freq=noraman PBEPBE/SDD
converged: YES YES NO NO
title: Mulliken charges:
elementType: O C C C C C C C C C C C C C C C C H H H H H H H H H H H H H H H H H H
charge: -0.450298 -0.354033 -0.426499 -0.370808 0.457778 0.504458 -0.346964 -0.403298 -0.449871 -0.417430 -0.388216 -0.231307 -0.227873 -0.248784 -0.230131 -0.244990 -0.246945 0.211993 0.196651 0.203077 0.203484 0.242909 0.188288 0.185320 0.234726 0.233113 0.243465 0.244302 0.223550 0.224628 0.222202 0.222315 0.227045 0.226815 0.341328
chargesum: 0.00000
title: Mulliken charges with hydrogens summed into heavy atoms:
elementType: O C C C C C C C C C C C C C C C C
charge: -0.108970 -0.142040 -0.026771 0.075585 0.457778 0.504458 0.026644 -0.168572 -0.216758 -0.173965 -0.143914 -0.007757 -0.003245 -0.026581 -0.007816 -0.017945 -0.020130
polarizability: 1.90115002e+02 -1.89779584e+01 1.68929356e+02 1.09339873e+01 -1.21690946e+01 1.43965670e+02
1716.lowfreq: -8.0422 -6.7405 -0.0005 -0.0003 0.0006 4.0256 30.6228 36.3812 44.2870
frequency: 30.1211 36.3471 44.1837 53.2007 61.5332 76.2175 113.8441 173.1157 196.6070 220.4904 254.9993 259.4434 273.8641 294.4181 402.4372 403.7549 416.7342 464.2570 472.5838 556.9987 581.5049 614.1284 617.4675 633.5397 705.1123 706.4559 732.7240 760.2925 774.5274 803.7622 839.4644 853.2304 853.9379 888.2702 921.7721 925.1599 965.2765 976.1388 977.2311 990.1000 990.7743 993.9494 994.3191 1009.5608 1021.8339 1028.3981 1034.7885 1061.5088 1074.6940 1081.6441 1107.3532 1162.9932 1170.8821 1171.9438 1187.9295 1189.5722 1191.8092 1202.3828 1208.1692 1247.9185 1259.7626 1283.3843 1296.9473 1305.7351 1330.8585 1336.7064 1354.3468 1379.9417 1383.9629 1415.0567 1436.7264 1440.8316 1463.3836 1471.6406 1480.4225 1483.8662 1487.5594 1590.2425 1592.9932 1608.9322 1614.2381 2924.0882 2960.8679 2969.7696 2971.8024 2993.5161 3017.9280 3065.0558 3114.6863 3115.8397 3119.4671 3122.6592 3132.7477 3136.4364 3143.0649 3146.7289 3161.2671 3162.0834 3565.1001
redmass: 3.9668 3.6728 5.1903 1.8472 4.7769 4.3940 3.2844 2.5349 4.6231 4.3041 4.1454 3.4469 1.1397 4.3507 2.8198 2.8201 3.5357 4.0568 3.6966 3.2150 3.6876 5.8481 6.3470 4.5980 1.7544 1.6684 2.4865 1.5392 1.7672 1.5550 3.5516 1.2494 1.2479 1.3844 1.4939 1.4908 6.6350 1.4015 1.3894 5.4014 5.8322 1.3261 1.3476 2.7022 2.7565 2.1985 2.4126 1.9405 1.8349 1.6079 1.8764 1.2303 1.0621 1.0538 1.5330 1.3315 1.2652 1.7511 1.3716 1.4878 1.3576 1.1490 1.2957 1.3615 1.3038 1.2752 1.4811 6.9386 7.0231 1.4387 2.2114 2.1449 1.0994 1.0896 2.1827 2.0972 1.1214 6.0700 5.9930 6.0623 6.0678 1.0544 1.0635 1.0801 1.1035 1.0623 1.0999 1.1033 1.0864 1.0860 1.0862 1.0864 1.0911 1.0918 1.0960 1.0952 1.1014 1.1014 1.0664
irintensity: 0.1575 0.2199 0.2990 10.8243 0.1352 1.1026 1.4090 1.2404 2.1086 2.0094 2.7628 9.3620 141.1792 1.3036 0.2191 0.2594 14.2598 3.0649 5.6732 32.8127 10.4142 1.0992 0.3958 1.9561 46.2451 64.2431 8.2392 52.1433 24.7576 2.6709 3.3614 0.1570 0.0692 3.8177 2.3339 1.0883 56.0669 0.0316 0.1595 1.3937 0.2407 1.5244 0.3805 42.0776 10.4429 8.2896 0.8816 4.9631 9.4496 1.0375 8.0884 2.4102 0.0952 0.0835 1.0986 1.1298 0.6813 9.7578 11.1635 14.2954 7.1474 5.4432 6.9395 8.2052 2.4649 0.8850 3.7197 0.6466 0.4615 7.5209 10.0591 6.2715 1.6529 2.5022 23.1907 14.6589 7.2974 3.5697 0.0489 14.2652 5.5647 59.3333 20.5112 30.8304 41.6020 29.5487 25.1354 59.6982 8.7839 6.3538 1.3306 0.1393 12.2297 20.1076 40.2348 43.9847 31.5713 18.9113 1.9252
temp: 298.150 k
press: 1.00000 atm
elementType: 8 6 6 6 6 6 6 6 6 6 6 6 6 6 6 6 6 1 1 1 1 1 1 1 1 1 1 1 1 1 1 1 1 1 1
symmnumber: 1
zpe: 770983.2 jmol-1
zpe.correction: 0.293652 hartree
zpe.thermalcorrener: 0.309690 hartree
zpe.thermalcorrenthalpy: 0.310634 hartree
zpe.thermalcorrgfe: 0.247823 hartree
zpe.sumelectzpe: -694.476880 hartree
zpe.sumelectthermal: -694.460843 hartree
zpe.sumelectthermalent: -694.459899 hartree
zpe.sumelectthermalfe: -694.522709 hartree
dipole: 0.3068 -1.1825 1.2521
dipole: 1.7494
quadrupole: -100.7138 -92.7851 -95.7600
quadrupole: 3.1927 -4.0447 -6.0807
quadrupole: -4.2941 3.6345 0.6596 3.1927 -4.0447 -6.0807
hfenergy: -694.7705324 hartree
pointgroup: C01 [X(C16H18O1)]
dipole: -0.1712082 -0.4344425 -0.5056229 debye
polarizability: 193.892111|16.2250971|164.6442893|12.1374738|11.5519108|144.4736283 unknown
InChI: InChI=1S/C16H18O/c17-13-7-12-16(14-8-3-1-4-9-14)15-10-5-2-6-11-15/h1-6,8-11,16-17H,7,12-13H2
charge 0 multiplicity 1
35 atoms
O  4.445084 -2.812111 0.064569
C  0.030431 -0.511881 0.541174
C  0.837163 -1.61325 -0.210124
C  2.303908 -1.714723 0.26059
C  -1.486054 -0.59341 0.301501
C  0.573362 0.890468 0.214067
C  3.081476 -2.795073 -0.495168
C  -2.359679 0.074134 1.200735
C  1.414737 1.572209 1.128434
C  -2.059007 -1.291625 -0.791471
C  0.270718 1.516561 -1.023254
C  -3.758339 0.045293 1.018612
C  1.946323 2.845116 0.817086
C  -3.460932 -1.321844 -0.980597
C  0.80214 2.785595 -1.34016
C  -4.317208 -0.654555 -0.07731
C  1.643477 3.456121 -0.420671
H  0.198572 -0.67966 1.625645
H  0.814685 -1.40721 -1.29996
H  0.332755 -2.588901 -0.054862
H  2.338905 -1.950912 1.342572
H  2.821356 -0.747659 0.123173
H  3.103232 -2.556477 -1.58162
H  2.590439 -3.78504 -0.364226
H  -1.934186 0.626692 2.047962
H  1.657246 1.10349 2.090505
H  -1.416729 -1.824018 -1.501078
H  -0.399883 1.014996 -1.731329
H  -4.412007 0.565776 1.72798
H  2.594858 3.356478 1.537633
H  -3.882492 -1.868645 -1.832126
H  0.555287 3.255943 -2.299064
H  -5.403106 -0.679723 -0.222115
H  2.052998 4.442849 -0.664639
H  4.98667 -3.493903 -0.407164
