program: Gaussian 09
title: 000092496
version: EM64L-G09RevD.01
frameworkgroup: C1[X(C13H16O)]
method: RPBEPBE
basis: SDD
operation: Freq
keyword: #pfreq=noraman
keyword: PBEPBE/SDD
title: #p freq=noraman PBEPBE/SDD
converged: YES YES NO NO
title: Mulliken charges:
elementType: O C C C C C C C C C C C C C H H H H H H H H H H H H H H H H
charge: -0.228958 0.143204 0.060360 0.365575 0.340867 -0.439828 -0.442190 -0.816691 -0.005325 -0.821327 -0.819638 -0.249403 -0.112260 -0.749073 0.230258 0.233746 0.230902 0.254603 0.224823 0.228895 0.222953 0.230624 0.225491 0.266798 0.216837 0.251611 0.257817 0.234477 0.229675 0.235178
chargesum: 0.00000
title: Mulliken charges with hydrogens summed into heavy atoms:
elementType: O C C C C C C C C C C C C C
charge: -0.228958 0.143204 0.060360 0.365575 0.340867 -0.209571 -0.208444 -0.106364 -0.005325 -0.138855 -0.110511 0.002208 0.145558 -0.049743
polarizability: 2.03998749e+02 4.12356073e-01 1.54261023e+02 -6.75647268e+00 2.68089490e-03 9.13854265e+01
1716.lowfreq: -9.5088 -0.0007 -0.0005 -0.0004 4.4459 9.7712 37.7572 59.9730 92.3354
frequency: 37.6145 59.9667 92.3309 112.1608 119.9264 131.5215 149.6920 171.6294 179.6760 198.7542 225.7472 241.5318 265.8517 310.4300 327.1453 352.8397 372.5946 406.3466 449.6323 471.5836 531.4908 558.9838 584.5069 679.0999 716.6618 752.1976 768.7763 822.3474 844.6338 863.1477 908.1743 939.4227 952.9363 993.2812 1000.9908 1016.8260 1023.4342 1042.4167 1046.4839 1050.9536 1053.4291 1094.1734 1130.8360 1176.6098 1223.1971 1258.5066 1259.8790 1289.8067 1308.3279 1354.1777 1392.8810 1393.9440 1396.5286 1402.5151 1408.0589 1455.7038 1457.1442 1459.5200 1462.8557 1465.8333 1467.0951 1477.9871 1478.5682 1487.5729 1543.0125 1584.8312 1602.9466 1654.8648 2966.4562 2967.1656 2970.8574 2986.5883 3037.9515 3038.6975 3043.3780 3070.4873 3081.2770 3082.1162 3090.5173 3102.3505 3103.7320 3116.3609 3125.2475 3141.4024
redmass: 4.3622 3.2776 2.1229 1.5269 1.2385 1.5271 1.5451 1.6628 1.4357 2.0052 2.8400 3.0607 3.8068 3.0497 2.6072 3.0370 5.0809 3.4342 4.1843 3.3335 3.2790 4.2215 3.8561 3.2622 5.1645 3.2476 4.4813 1.2531 2.1242 2.9136 2.1433 2.0629 1.3335 1.0875 1.3780 2.0104 1.4521 1.7358 1.5836 1.6090 1.5951 2.0055 2.5763 1.4929 2.7717 2.0285 2.6612 1.4345 1.8708 6.5148 1.2340 1.3286 2.4320 1.2718 1.2441 1.4920 1.1122 1.0609 1.1003 1.3327 1.1482 1.1827 1.1017 1.1073 8.1964 5.6338 6.7910 5.6207 1.0373 1.0381 1.0410 1.0372 1.0955 1.0961 1.0957 1.0965 1.0960 1.0981 1.1000 1.0962 1.0939 1.0869 1.0908 1.0968
irintensity: 2.7940 1.2038 1.9405 1.1349 0.5841 1.5418 0.3807 1.5088 0.6374 1.1279 1.2674 4.2617 2.5510 3.8462 0.2717 1.9332 5.1684 0.8311 1.6864 0.9151 3.9319 5.4056 2.3170 5.0380 9.1057 6.2332 10.2047 28.7918 2.3809 0.4225 62.8866 15.3024 0.1637 47.3834 11.0814 7.8400 6.8345 1.2953 4.6268 6.2807 0.4023 12.5424 7.0443 11.9990 34.3098 0.6344 1.9051 66.6549 51.0892 0.9204 18.2719 0.9929 45.5395 14.4138 15.7207 3.5049 21.6290 23.3203 48.1176 21.7953 3.9575 16.0071 29.4363 14.4788 134.9668 22.4568 5.9280 148.5332 20.3120 49.2923 18.5658 26.4810 16.6866 39.2361 2.0613 19.9480 9.1764 24.4397 16.9861 9.3627 21.0025 12.4726 12.6820 35.4344
temp: 298.150 k
press: 1.00000 atm
elementType: 8 6 6 6 6 6 6 6 6 6 6 6 6 6 1 1 1 1 1 1 1 1 1 1 1 1 1 1 1 1
symmnumber: 1
zpe: 654591.4 jmol-1
zpe.correction: 0.249321 hartree
zpe.thermalcorrener: 0.264669 hartree
zpe.thermalcorrenthalpy: 0.265613 hartree
zpe.thermalcorrgfe: 0.207000 hartree
zpe.sumelectzpe: -579.161550 hartree
zpe.sumelectthermal: -579.146202 hartree
zpe.sumelectthermalent: -579.145257 hartree
zpe.sumelectthermalfe: -579.203870 hartree
dipole: -0.2218 -2.5548 -2.1782
dipole: 3.3646
quadrupole: -70.6743 -79.6542 -89.3291
quadrupole: 3.6053 3.5325 -3.4911
quadrupole: 9.2116 0.2317 -9.4432 3.6053 3.5325 -3.4911
hfenergy: -579.4108706 hartree
pointgroup: C01 [X(C13H16O1)]
dipole: 0.0354001 -0.826083 1.0337374 debye
polarizability: 203.7328821|-4.4980867|152.3040839|-6.5428533|-11.4604317|93.6082319 unknown
InChI: InChI=1S/C13H16O/c1-5-6-12(14)13-10(3)8-7-9(2)11(13)4/h5-8H,1-4H3
charge 0 multiplicity 1
30 atoms
O  1.755282 0.95805 -1.56053
C  -0.963293 -0.779985 -0.033085
C  -0.19817 0.410619 -0.226975
C  -2.346101 -0.681717 0.311576
C  -0.803933 1.703979 -0.115177
C  -2.926806 0.599052 0.452561
C  -2.170452 1.770426 0.238449
C  -0.366375 -2.16542 -0.241931
C  1.278056 0.345361 -0.552644
C  -3.193843 -1.926086 0.512278
C  -0.026318 2.989788 -0.344886
C  2.162561 -0.392924 0.401456
C  3.516636 -0.434173 0.236428
C  4.490772 -1.111382 1.161103
H  -3.986358 0.679504 0.724219
H  -2.645565 2.752412 0.346999
H  -1.003437 -2.76187 -0.921761
H  0.642107 -2.133256 -0.681609
H  -0.305279 -2.731363 0.708796
H  -3.301636 -2.504491 -0.426415
H  -2.750574 -2.612808 1.258245
H  -4.207269 -1.660135 0.857925
H  0.905766 3.024015 0.24894
H  0.276517 3.084514 -1.401701
H  -0.639488 3.865503 -0.071074
H  1.685439 -0.868644 1.267669
H  3.924314 0.077175 -0.649494
H  5.077131 -1.878509 0.617589
H  3.988016 -1.595883 2.015454
H  5.227098 -0.38315 1.554997
