program: Gaussian 09
title: 000092497
version: EM64L-G09RevD.01
frameworkgroup: C1[X(C10H9ClO4)]
method: RPBEPBE
basis: SDD
operation: Freq
keyword: #p
keyword: freq=noraman
keyword: PBEPBE/SDD
title: #p freq=noraman PBEPBE/SDD
converged: YES YES NO NO
title: Mulliken charges:
elementType: Cl O O O O C C C C C C C C C C H H H H H H H H H
charge: -0.106956 -0.304599 -0.280932 -0.107841 -0.189549 0.198316 0.281241 0.452414 -0.481443 -0.282973 -0.309147 -0.183232 0.260748 -0.521005 -0.747274 0.296330 0.274836 0.269046 0.249917 0.223007 0.240458 0.259764 0.255659 0.253218
chargesum: 0.00000
title: Mulliken charges with hydrogens summed into heavy atoms:
elementType: Cl O O O O C C C C C C C C C C
charge: -0.106956 -0.304599 -0.280932 -0.107841 -0.189549 0.198316 0.281241 0.452414 -0.185114 -0.008137 -0.040101 -0.183232 0.260748 0.192377 0.021366
polarizability: 2.10879356e+02 5.39676034e+00 1.44726562e+02 2.89430640e+00 -6.93396088e+00 6.69594453e+01
1716.lowfreq: -1.8854 -0.0003 0.0020 0.0022 4.2289 7.4638 24.9423 37.0588 50.3616
frequency: 24.9078 37.0259 50.3592 62.7581 81.8064 90.6277 129.4142 138.5547 157.3724 185.9150 235.6190 240.2701 284.5511 318.8709 344.8755 388.5622 436.0373 460.1922 506.5751 530.3121 551.0784 560.5765 575.0925 661.2552 675.8538 707.3883 734.3308 753.1980 831.8265 863.7299 900.5031 923.4306 963.6757 984.1942 1002.0321 1040.6956 1096.1605 1110.2456 1151.7885 1156.7127 1162.8763 1191.7856 1242.8831 1270.7147 1377.6656 1386.0273 1394.8589 1436.6590 1451.7857 1453.5607 1458.7795 1479.2144 1479.8736 1571.1605 1598.3102 1691.0838 1710.6819 2982.4662 3009.6727 3087.7587 3097.9091 3133.3757 3146.9696 3173.4106 3178.8025 3200.3800
redmass: 8.1926 8.8960 3.8637 2.2187 2.2419 1.5290 1.5349 6.5802 4.5497 3.1708 8.2769 9.5933 4.3098 6.6590 4.5091 11.0859 5.4525 3.7698 6.7915 4.5681 3.9998 5.0117 5.7410 7.2230 5.5755 4.8169 7.7463 4.1484 1.6202 5.4064 7.2219 1.5124 1.3545 2.2770 3.3712 1.6424 3.4487 1.2358 1.8535 1.7097 1.9896 1.8412 3.6276 1.6159 4.3861 1.2695 4.3855 1.2986 1.0558 1.0469 1.0618 1.0816 2.5988 7.7717 6.6714 10.3922 12.9227 1.0330 1.0370 1.1004 1.0973 1.1038 1.1010 1.0924 1.0896 1.0963
irintensity: 2.2450 0.3658 1.3663 5.1780 0.9918 0.2135 1.7801 4.1378 3.1252 5.3759 6.3979 1.0696 9.1891 0.3556 3.2264 8.0902 25.3460 6.5548 1.4764 1.7972 3.0065 6.4777 18.5907 47.4493 16.0418 14.2785 203.7050 13.1282 29.7245 96.5109 155.1425 29.8425 0.4721 152.8542 11.9971 10.2514 299.4068 5.6574 286.1538 133.8810 22.8862 24.9474 301.0491 84.8801 53.3928 41.6372 46.7939 12.7183 23.5740 21.9427 14.2777 32.0806 83.3272 30.2500 75.3284 172.6892 291.3225 70.2097 0.3694 30.9644 4.4383 16.5983 8.9363 2.7336 0.2934 1.9661
temp: 298.150 k
press: 1.00000 atm
elementType: 17 8 8 8 8 6 6 6 6 6 6 6 6 6 6 1 1 1 1 1 1 1 1 1
symmnumber: 1
zpe: 444514.6 jmol-1
zpe.correction: 0.169307 hartree
zpe.thermalcorrener: 0.184805 hartree
zpe.thermalcorrenthalpy: 0.185749 hartree
zpe.thermalcorrgfe: 0.123891 hartree
zpe.sumelectzpe: -1146.314461 hartree
zpe.sumelectthermal: -1146.298963 hartree
zpe.sumelectthermalent: -1146.298019 hartree
zpe.sumelectthermalfe: -1146.359877 hartree
dipole: 6.8886 0.7919 2.6612
dipole: 7.4271
quadrupole: -93.9452 -93.7614 -95.0188
quadrupole: 5.9188 3.4779 0.0734
quadrupole: 0.2966 0.4804 -0.7770 5.9188 3.4779 0.0734
hfenergy: -1146.4837681 hartree
pointgroup: C01 [X(C10H9Cl1O4)]
dipole: -2.6585493 0.5192537 -1.0958005 debye
dipolederiv: -0.6087904 0.3557924 0.038473 0.5907225 -0.7985248 -0.0930031 0.0915446 -0.1096338 -0.1671516 -2.2367163 -0.5510286 0.1707273 -0.810714 -0.7154384 0.209054 0.1611653 0.2066532 -0.3066111 -0.7875861 0.6647758 -0.0815095 0.5826526 -1.0404535 0.1594514 0.0149779 -0.0414864 -0.3485467 -0.9072716 -0.2806959 -0.1140511 -0.2831763 -0.9641381 -0.1787357 -0.1156122 -0.1792135 -0.2781874 -0.5830664 0.1200157 -0.108282 -0.459653 -0.8158456 0.2901829 0.2309141 0.3226373 -0.4289405 0.0950004 -0.6664101 -0.0604394 -0.7700855 0.9075364 -0.0708572 -0.1929182 0.2037499 -0.0134133 1.437424 0.2001517 -0.047376 0.0769328 0.0255154 0.0897429 0.2123376 0.0168526 0.0697363 -1.0497014 -0.0144374 -0.0675575 0.2391258 -0.0564913 -0.0133804 -0.0557263 -0.0141361 -0.0014459 0.1082723 0.351996 0.0449907 -0.2761351 -0.1033164 0.0361941 -0.0434473 0.0936841 -0.0940107 -0.310505 0.1090509 0.0296476 0.2801111 -0.0167557 0.0343452 -0.0117829 -0.0042575 -0.0990615 0.1786638 -0.0884232 0.0128121 0.1861987 -0.0753402 0.037259 0.0565151 -0.0157208 -0.1092699 2.2193453 -0.1395766 0.1250542 -0.4638007 1.6898715 0.2861103 0.0705726 0.3066413 0.2584833 1.9592569 0.2761099 -0.0350499 1.2168759 1.2956949 -0.5702521 -0.4633456 -0.5791958 0.5307468 0.5199765 -0.3409973 0.093135 -0.1382999 0.4147719 -0.1488792 0.2023107 -0.3053207 0.408012 -0.447423 0.0663745 -0.0568949 0.1564937 -0.0512537 0.0465274 -0.1011189 0.0252419 -0.0059908 0.1051563 -0.0629442 -0.0096105 -0.0134591 0.0579444 -0.0226585 -0.0085681 -0.0221282 0.158835 0.0613557 -0.0450759 -0.0232953 -0.0544417 0.0336813 -0.0308744 -0.0219745 -0.0121726 0.1463349 0.098081 0.0487893 0.0108761 0.034199 0.0470997 -0.0219367 0.0028239 -0.0180055 0.1567519 -0.0742604 -0.0353881 -0.0590823 -0.1169469 0.0653174 -0.0319548 -0.0759296 0.0297594 0.0424654 -0.0299874 -0.00871 0.1142223 0.0133172 0.0570865 0.0361901 -0.0019992 0.1605975 -0.1210721 0.0601466 0.0902259 0.0016717 0.1074126 -0.0992787 -0.0382061 0.0111733 -0.0682873 0.0604557 0.1044455 0.0000719 -0.0120651 0.0196776 -0.0024727 -0.0862966 0.0152331 -0.082144 0.0881045 0.000353 -0.053011 0.0152417 -0.1011029 0.0142629 0.0492666 0.0314672 0.0523823 0.1097985 0.0878306 0.0033443 0.018362 -0.0159044 0.1305266 0.0327108 -0.0086128 0.0335026 -0.0560228 unknown
polarizability: 209.2487279|-11.211423|146.6243072|5.5015882|3.6810504|66.6923279 unknown
InChI: InChI=1S/C10H9ClO4/c1-6(12)15-8-4-3-7(10(11)13)5-9(8)14-2/h3-5H,1-2H3
charge 0 multiplicity 1
24 atoms
Cl 4.435454 -1.719306 -0.121041
O  -2.174968 -0.054282 -0.355057
O  -0.736701 2.296026 0.335052
O  4.192906 0.939848 0.424432
O  -2.639474 -2.091811 0.743635
C  -0.082967 1.087511 0.062007
C  -0.763482 -0.133572 -0.230549
C  2.048546 -0.13929 0.004308
C  1.318739 1.068954 0.181638
C  -0.042837 -1.332265 -0.427705
C  1.358718 -1.338001 -0.309651
C  3.518172 -0.052902 0.154803
C  -3.044553 -1.074831 0.161223
C  -1.612237 2.85708 -0.719376
C  -4.472107 -0.67359 -0.116591
H  1.837754 2.001466 0.421851
H  -0.577525 -2.257241 -0.650199
H  1.918455 -2.265004 -0.453909
H  -2.452828 2.179677 -0.942321
H  -1.025554 3.052688 -1.63689
H  -1.980466 3.805737 -0.301926
H  -4.7110 0.260288 0.421901
H  -5.151077 -1.472432 0.213419
H  -4.613471 -0.479348 -1.193456
