program: Gaussian 09
title: 000092489
version: EM64L-G09RevD.01
frameworkgroup: C1[X(C4ClF7O)]
method: RPBEPBE
basis: SDD
operation: Freq
keyword: #p
keyword: freq=noraman
keyword: PBEPBE/SDD
title: #p freq=noraman PBEPBE/SDD
converged: YES YES NO NO
title: Mulliken charges:
elementType: Cl F F F F F F F O C C C C
charge: 0.114086 -0.134222 -0.128078 -0.101847 -0.101952 -0.131977 -0.132144 -0.129726 -0.231207 0.433259 -0.010090 0.238534 0.315364
chargesum: 0.00000
title: Mulliken charges with hydrogens summed into heavy atoms:
polarizability: 7.34721591e+01 8.17783381e+00 6.37135413e+01 3.29012717e-01 -1.81964477e+00 4.40878994e+01
1716.lowfreq: -6.5463 -4.3484 -0.0021 0.0016 0.0017 1.5041 17.2922 37.6230 65.2679
frequency: 17.2426 37.6063 65.2544 80.4802 136.2796 168.6134 183.0325 205.8103 269.6394 273.5404 290.2753 338.6028 374.9939 387.3708 410.7698 458.7922 479.4846 522.2106 536.1763 550.8299 586.2337 708.9452 731.1871 866.9998 989.1422 1010.0538 1014.6099 1038.5121 1077.2609 1164.0427 1206.2172 1216.8728 1778.6437
redmass: 19.3916 20.2886 18.5594 19.1392 20.9619 18.8132 19.4221 17.3252 19.3556 19.2257 19.3264 18.2667 14.2300 24.2758 17.2064 17.6686 14.9406 14.2081 16.4002 16.7778 17.0938 16.3257 16.5900 13.2594 13.0879 12.8786 13.3689 13.4454 13.9974 12.9190 13.3225 12.3335 12.1308
irintensity: 0.0431 0.0704 0.0889 0.3335 0.2877 0.4899 3.0533 5.4147 1.1305 1.0155 1.0636 1.5203 4.5513 0.5376 1.3464 5.0259 5.4361 9.7218 7.5825 9.2607 4.7306 14.5294 44.7715 219.3449 14.5706 78.7338 335.5112 187.9192 458.4801 156.2464 245.8434 38.8764 17.0201
temp: 298.150 k
press: 1.00000 atm
elementType: 17 9 9 9 9 9 9 9 8 6 6 6 6
symmnumber: 1
zpe: 114696.3 jmol-1
zpe.correction: 0.043686 hartree
zpe.thermalcorrener: 0.056706 hartree
zpe.thermalcorrenthalpy: 0.057650 hartree
zpe.thermalcorrgfe: 0.001531 hartree
zpe.sumelectzpe: -1385.520348 hartree
zpe.sumelectthermal: -1385.507328 hartree
zpe.sumelectthermalent: -1385.506383 hartree
zpe.sumelectthermalfe: -1385.562503 hartree
dipole: -0.1558 0.4356 -0.5944
dipole: 0.7532
quadrupole: -78.4396 -80.2209 -77.7698
quadrupole: 2.0861 -0.5581 -1.5335
quadrupole: 0.3705 -1.4108 1.0403 2.0861 -0.5581 -1.5335
hfenergy: -1385.564034 hartree
pointgroup: C01 [X(C4Cl1F7O1)]
dipole: -0.1064589 -0.1541479 -0.2295959 debye
dipolederiv: -0.1588358 0.0409663 0.1535827 0.0503904 -0.1049744 -0.1030775 0.0974956 -0.0729175 -0.5656977 -0.4037435 0.0516945 0.1682503 -0.0325799 -0.3087732 -0.1550283 -0.0939056 -0.088635 -0.7334574 -0.3985736 -0.014106 0.0383613 -0.2297166 -0.6686594 0.1549612 0.0493385 0.1642913 -0.3349829 -0.3361919 0.0015952 0.0532712 -0.0851899 -0.6227301 0.2865343 0.0933652 0.2209461 -0.485629 -0.5997394 -0.2302869 -0.221696 -0.1199997 -0.4273141 -0.18822 -0.1619189 -0.1800537 -0.4650054 -0.305974 0.1002394 -0.088576 0.1286768 -0.3089509 0.3387668 -0.0579417 0.3277095 -0.5825887 -1.0080347 0.1312179 0.1050172 0.2462613 -0.1648514 0.0492507 0.0082187 0.0855047 -0.183524 -0.2427544 0.0769816 -0.0389836 -0.0438756 -0.3515108 0.3754547 0.1353793 0.3645913 -0.5924533 -1.5505507 -0.0765073 -0.1370951 0.1087643 -0.3501905 0.0224731 -0.1509287 0.0308703 -0.4772375 1.5460472 0.1509066 -0.1403381 0.4930469 1.2223334 0.1056725 0.3242786 -0.0493707 1.2356926 1.1129937 0.2046 0.0796481 0.1141248 1.1622509 -0.0193291 -0.1220391 0.0774993 1.6199929 1.028431 -0.2269934 0.1347223 -0.4965509 0.34643 -0.447155 0.1152174 -0.4243802 0.7239025 1.3169262 -0.2103078 -0.1061642 -0.1333518 0.5769405 -0.4203036 -0.2365594 -0.4560553 0.840988 unknown
polarizability: 71.5746422|-0.093219|44.903939|-9.1649199|-4.255147|64.7950186 unknown
InChI: InChI=1S/C4ClF7O/c5-3(9,10)4(11,12)13-2(8)1(6)7
charge 0 multiplicity 1
13 atoms
Cl 2.590673 -0.773076 -1.757216
F  0.516147 0.658757 1.45358
F  0.963761 1.640262 -0.535776
F  1.964742 -1.657677 0.678001
F  3.150934 0.277379 0.621949
F  -1.806677 0.984926 -1.612202
F  -3.78278 0.268571 0.276345
F  -2.268794 -0.975277 1.448605
O  -0.2430 -0.374444 -0.499951
C  0.802358 0.383075 0.09164
C  2.123923 -0.444168 -0.009783
C  -1.52559 0.1751 -0.520641
C  -2.485697 -0.163527 0.365348
