program: Gaussian 09
title: 000092483
version: EM64L-G09RevD.01
frameworkgroup: C1[X(C9H6BrNO3)]
method: RPBEPBE
basis: SDD
operation: Freq
keyword: #p
keyword: freq=noraman
keyword: PBEPBE/SDD
title: #p freq=noraman PBEPBE/SDD
converged: YES YES NO NO
title: Mulliken charges:
elementType: Br O O O N C C C C C C C C C H H H H H H
charge: 0.108481 -0.200333 -0.257986 -0.256312 -0.019899 0.375079 -0.352337 -0.365334 -0.185588 0.164560 -0.079842 0.184599 -0.501882 -0.173545 0.282332 0.273110 0.274313 0.243972 0.242640 0.243971
chargesum: 0.00000
title: Mulliken charges with hydrogens summed into heavy atoms:
elementType: Br O O O N C C C C C C C C C
charge: 0.108481 -0.200333 -0.257986 -0.256312 -0.019899 0.375079 -0.070005 -0.092224 0.088725 0.164560 -0.079842 0.184599 0.228701 -0.173545
polarizability: 2.53095873e+02 1.33478495e+01 1.49927159e+02 -3.79946881e-04 -1.35468433e-03 5.30214552e+01
1716.lowfreq: -10.6322 -4.5929 -4.4792 -0.0009 -0.0007 -0.0001 32.6927 51.4482 51.8363
frequency: 32.6800 51.4338 51.8349 88.9025 102.7716 126.8556 142.0300 146.6662 190.3155 257.4222 267.3599 276.8062 338.2902 364.0787 378.4661 419.3570 506.5451 566.5792 596.9317 658.0522 691.9796 726.5893 751.9810 768.5447 800.7479 876.3496 893.1254 899.4003 930.7336 957.8043 1019.7256 1064.1326 1090.3723 1114.2211 1153.3746 1174.3135 1217.7365 1284.8369 1319.7127 1356.9247 1423.1574 1449.7488 1454.1314 1461.0985 1518.8584 1599.7323 1644.7820 2173.5309 3006.9703 3109.5840 3123.6009 3156.7249 3225.0621 3252.9814
redmass: 8.5066 5.5887 9.9840 2.4947 1.5289 6.4797 4.2529 11.6893 6.1659 8.1647 5.7582 8.3662 6.8503 6.6282 4.4353 8.1231 11.7105 9.5976 4.5989 4.8368 6.7994 7.6700 6.7258 6.4469 1.2525 1.3803 10.0171 6.8526 6.1234 1.3801 1.4947 3.9079 4.1058 1.2638 1.4869 1.7536 3.3407 5.4075 2.7595 2.2218 1.2057 7.0917 1.0495 1.0527 6.5572 9.6172 8.4215 12.6233 1.0297 1.1047 1.0887 1.1047 1.0958 1.1032
irintensity: 1.2686 5.1227 0.4629 0.0883 0.0565 2.0159 0.0181 1.4512 9.1236 4.7562 11.3334 6.7654 16.8815 4.6076 0.3797 3.4058 0.7569 2.0197 0.1422 2.3637 16.2058 10.0590 1.3366 13.4493 70.3888 0.0875 19.2634 1.7513 19.2059 19.2640 81.3725 38.2923 44.3159 0.0157 53.2577 197.2370 494.7569 26.0773 30.9410 32.0653 58.0407 182.7075 15.6301 13.2296 52.4662 311.3346 152.9485 7.8006 38.4882 24.6937 3.5033 13.2268 0.9104 0.5972
temp: 298.150 k
press: 1.00000 atm
elementType: 35 8 8 8 7 6 6 6 6 6 6 6 6 6 1 1 1 1 1 1
symmnumber: 1
zpe: 342466.6 jmol-1
zpe.correction: 0.130439 hartree
zpe.thermalcorrener: 0.144251 hartree
zpe.thermalcorrenthalpy: 0.145195 hartree
zpe.thermalcorrgfe: 0.087076 hartree
zpe.sumelectzpe: -639.382835 hartree
zpe.sumelectthermal: -639.369023 hartree
zpe.sumelectthermalent: -639.368079 hartree
zpe.sumelectthermalfe: -639.426198 hartree
dipole: 1.0287 4.0502 -0.0008
dipole: 4.1788
quadrupole: -67.1289 -91.6423 -89.8803
quadrupole: 8.7392 0.0014 -0.0044
quadrupole: 15.7549 -8.7584 -6.9965 8.7392 0.0014 -0.0044
hfenergy: -639.5132739 hartree
pointgroup: C01 [X(C9H6Br1N1O3)]
dipole: 0.6275281 1.5195734 0.0044355 debye
dipolederiv: -0.3730856 0.2150167 0.0001533 0.5512495 -0.2520512 -0.0004062 0.0010656 -0.0007056 0.0922786 -0.3494815 0.0301905 -0.0001419 -0.0514689 -0.5816315 -0.0013881 -0.0005665 -0.0013668 -0.0668966 -1.6294947 -0.2995511 -0.0020735 -0.7225655 -0.6531536 -0.0018088 -0.0034048 -0.0014869 -0.2796223 -0.9351924 0.2331484 0.0002405 0.3614903 -0.9035468 -0.001602 0.0006831 -0.001719 -0.3239787 -0.1727968 -0.001585 0.0000984 -0.088554 -0.2818693 -0.0004135 -0.0002642 -0.0001942 -0.2432415 -0.9574907 0.0201151 -0.0008332 -0.2561051 0.2725749 0.0003268 -0.0013088 0.0006507 0.0559176 1.3384145 0.2023834 0.0018147 0.5180572 0.0087286 0.0006645 0.0028497 0.0003887 -0.0468445 0.7245932 -0.0816577 0.0005444 0.0538198 -0.0146897 0.0004182 0.0008639 0.0002677 -0.1603831 -0.3642022 0.1730903 0.0002435 0.8270441 -0.2592552 0.0004761 0.0019385 -0.000129 -0.1522609 -1.3144269 -0.0516814 -0.0012938 -0.4033708 -0.0356774 -0.0005813 -0.0024127 -0.0004023 0.0332729 0.4777696 -0.4877991 -0.0008255 -1.0727772 0.8533908 0.0014138 -0.0022569 0.0019768 -0.0624078 2.5928878 0.0318335 0.0020252 0.0698213 1.1984343 0.0032351 0.0020519 0.0031977 0.2408736 0.8636335 0.0790571 0.0007148 0.0347432 0.2174541 -0.0001848 0.0005678 -0.0001302 0.282195 -0.0544436 -0.007236 -0.0001201 0.1017705 0.1726596 0.0005946 0.0003807 0.0005159 0.0661477 0.1335751 0.0028818 -0.0000051 0.0099683 0.0471016 -0.0002734 -0.000105 -0.0003109 0.1420348 0.1075168 0.0669757 0.0001106 0.0470858 0.0246752 -0.0004064 0.0001002 -0.00036 0.1959626 0.0097738 -0.0353611 -0.0002486 -0.0220954 0.1260581 -0.0002268 -0.0002378 -0.0002453 0.2051194 -0.0500877 -0.0172844 0.00436 0.0843916 0.0558532 -0.1002232 0.0543866 -0.0740806 -0.0522194 0.002513 -0.0551719 -0.0002868 -0.1271194 -0.0497079 -0.000706 -0.0005289 -0.0006447 0.1251342 -0.0499754 -0.0173649 -0.0044768 0.0846148 0.0546521 0.1010913 -0.0538025 0.074778 -0.0510818 unknown
polarizability: 254.7663706|-1.7368658|148.2557955|0.171249|0.2604174|53.0223209 unknown
InChI: InChI=1S/C9H6BrNO3/c1-13-9(12)6(5-11)4-7-2-3-8(10)14-7/h2-4H,1H3
charge 0 multiplicity 1
20 atoms
Br 4.415964 -1.661156 0.004017
O  1.897067 -0.400848 0.005114
O  -3.418736 -0.653396 -0.000556
O  -2.924318 1.628321 0.007292
N  -0.617593 -2.601598 -0.003208
C  1.261287 0.874685 0.008012
C  -0.160746 0.976666 0.007015
C  2.254047 1.866726 0.011487
C  3.531987 1.216926 0.010695
C  -1.12236 -0.021216 0.003153
C  3.26828 -0.150385 0.006941
C  -2.548768 0.428582 0.003647
C  -4.863122 -0.318995 -0.000474
C  -0.838008 -1.42557 -0.000627
H  -0.552126 2.003131 0.009879
H  2.072228 2.940058 0.014128
H  4.514984 1.679967 0.012667
H  -5.117991 0.262866 0.901071
H  -5.37191 -1.292266 -0.004213
H  -5.116665 0.269102 -0.898339
