program: Gaussian 09
title: 000092466
version: EM64L-G09RevD.01
frameworkgroup: C1[X(C8H11NO)]
method: RPBEPBE
basis: SDD
operation: Freq
keyword: #p
keyword: freq=noraman
keyword: PBEPBE/SDD
title: #p freq=noraman PBEPBE/SDD
converged: YES YES NO NO
title: Mulliken charges:
elementType: O N C C C C C C C C H H H H H H H H H H H
charge: -0.459168 -0.655601 -0.187239 0.429829 -0.332333 -0.403883 -0.402615 -0.231420 -0.226878 -0.243907 0.219888 0.218878 0.183434 0.248005 0.277165 0.282144 0.266815 0.222043 0.220881 0.224221 0.349742
chargesum: 0.00000
title: Mulliken charges with hydrogens summed into heavy atoms:
elementType: O N C C C C C C C C
charge: -0.109426 -0.106642 0.032648 0.429829 0.069979 -0.155878 -0.125450 -0.009377 -0.005997 -0.019686
polarizability: 1.17001797e+02 5.88812670e+00 9.29285947e+01 -5.62580306e+00 1.23147185e+01 6.45186343e+01
1716.lowfreq: -2.5622 -0.0008 0.0006 0.0007 7.6110 11.0754 42.8273 83.0943 106.3081
frequency: 42.7856 83.0906 106.3009 149.4200 218.1813 239.9193 276.5204 345.3054 383.5782 407.3655 477.8038 548.4792 571.6277 616.3176 665.4374 708.3895 762.2855 769.9228 861.4558 928.5043 943.5166 978.5228 985.0641 989.9118 996.9627 1005.9793 1024.4408 1070.8145 1093.8850 1136.5030 1169.6957 1182.4397 1202.7868 1210.0713 1247.4771 1302.1114 1323.4746 1367.1909 1386.8939 1393.9767 1441.5356 1465.4864 1483.0764 1593.6650 1613.7501 1640.4817 2898.1191 2936.2658 3021.6626 3118.1363 3127.7218 3141.1544 3149.4492 3161.4368 3456.8131 3586.2058 3596.0473
redmass: 4.0111 2.6220 1.5136 2.2581 3.7624 3.4049 1.1515 2.9130 3.8722 2.8655 4.3730 3.0087 2.3322 6.3552 1.7217 1.8099 3.4435 1.7528 1.2475 1.3971 2.1170 5.0642 1.4957 5.2847 1.3641 1.7067 2.2751 1.7486 2.0721 1.3271 1.0577 1.1069 1.6502 1.3057 1.2872 1.3202 1.3276 2.0396 2.3798 1.8659 2.1230 1.1056 2.2633 6.0833 5.7037 1.1138 1.0820 1.0610 1.1019 1.0843 1.0879 1.0922 1.0960 1.1013 1.0451 1.0976 1.0669
irintensity: 0.8585 8.0402 135.9211 11.1262 6.2967 1.2744 61.2003 9.5316 10.2684 0.0533 3.5224 28.3796 52.6202 0.2993 126.9425 54.3423 9.9827 47.7943 0.8520 4.8291 9.8537 69.2438 4.2910 1.3326 4.2348 25.2990 11.6622 2.9964 4.7566 8.4480 0.5071 2.1316 16.6006 6.5819 19.6825 9.3813 2.5861 7.2493 0.0835 7.9817 12.8708 4.8364 14.9818 0.2671 3.7274 66.9487 51.9170 95.3231 56.1312 0.6463 8.1263 20.2132 32.5713 20.3170 0.9770 0.5811 6.0976
temp: 298.150 k
press: 1.00000 atm
elementType: 8 7 6 6 6 6 6 6 6 6 1 1 1 1 1 1 1 1 1 1 1
symmnumber: 1
zpe: 458202.1 jmol-1
zpe.correction: 0.174520 hartree
zpe.thermalcorrener: 0.184600 hartree
zpe.thermalcorrenthalpy: 0.185544 hartree
zpe.thermalcorrgfe: 0.138667 hartree
zpe.sumelectzpe: -440.648762 hartree
zpe.sumelectthermal: -440.638683 hartree
zpe.sumelectthermalent: -440.637738 hartree
zpe.sumelectthermalfe: -440.684615 hartree
dipole: 1.1812 0.4851 0.5036
dipole: 1.3727
quadrupole: -52.1209 -57.5817 -57.2148
quadrupole: 2.2468 0.7138 -3.4364
quadrupole: 3.5183 -1.9426 -1.5757 2.2468 0.7138 -3.4364
hfenergy: -440.8232824 hartree
pointgroup: C01 [X(C8H11N1O1)]
dipole: 0.4709872 -0.1860339 -0.1876844 debye
dipolederiv: -0.5863317 -0.0707914 -0.1157004 -0.0913406 -0.8177364 0.0794134 -0.0953923 -0.004744 -0.1680555 -0.3722992 0.0975712 -0.0558006 0.0986225 -0.6574035 -0.0800007 -0.0784407 -0.065861 -0.5707134 0.23957 -0.1434014 0.0994769 -0.1638109 0.5242441 0.0183575 0.2171389 -0.0520669 0.3133184 0.2523278 0.0235777 -0.0099046 -0.0424076 -0.1079356 0.0226394 -0.0253461 0.0267832 -0.0802201 0.322473 -0.0388959 0.0757677 0.1161747 0.6440482 -0.0726836 0.002349 -0.0406586 0.1925946 -0.082769 0.0752233 0.0541097 0.1117455 0.0084464 0.0887684 0.0151541 0.06408 -0.1042781 -0.1486121 -0.0545892 -0.0087041 -0.0595268 -0.0298343 0.0660527 -0.009498 0.065746 -0.1221573 -0.0157594 -0.0803621 -0.0085047 -0.0897684 0.0466261 0.0991948 -0.0063227 0.0861679 -0.1044766 -0.0015512 0.0473104 0.072544 0.0574988 0.0186947 0.1142569 0.0685699 0.1093137 -0.0800712 0.0592159 -0.0307867 0.0506565 -0.024293 -0.0929741 0.0380463 0.0459929 0.0391848 -0.1388751 -0.0165153 0.011914 -0.0277761 -0.0006368 -0.1264742 -0.1126806 -0.0521474 -0.1097747 -0.1193684 0.0621654 -0.0244196 -0.0973393 -0.0153848 -0.0439822 -0.0590995 -0.0653513 -0.0587874 -0.1152645 -0.2928137 0.1103762 -0.0077819 0.0466523 -0.0612196 0.0089067 -0.0031629 0.0242166 0.0559754 0.0494281 -0.0665069 -0.0775374 -0.0569294 0.0239662 -0.0773838 -0.0604389 -0.0775422 0.0859239 0.1096455 0.0681466 0.026293 0.0629293 0.0075539 -0.0660759 0.0366612 -0.0641946 0.1181374 0.191816 -0.027476 0.0945756 -0.015224 0.1679201 0.0715799 0.1418345 0.1179831 0.1555615 -0.0225964 0.0436786 -0.047207 -0.0181111 0.1920102 0.0408273 -0.1144263 0.0706224 0.2968292 0.0226869 0.0933 0.0209498 0.1080339 -0.0479654 -0.0896978 0.0220911 -0.089729 0.1108012 0.0147451 -0.0665506 -0.0716097 -0.078741 -0.0102689 -0.1109558 -0.0828364 -0.1071836 0.0743446 -0.1396581 0.0351454 -0.0556469 0.0344737 0.1008543 -0.024458 -0.054518 -0.0242538 0.1341772 0.3548325 -0.0024635 0.0891394 0.0200437 0.2614301 0.0449923 0.0980895 0.0906984 0.0658167 unknown
polarizability: 116.9002854|-5.8047574|92.9104303|6.5657446|12.124314|64.6383102 unknown
InChI: InChI=1S/C8H11NO/c9-8(6-10)7-4-2-1-3-5-7/h1-5,8,10H,6,9H2
charge 0 multiplicity 1
21 atoms
O  2.291858 1.786836 -0.415483
N  1.947662 -1.745946 0.621428
C  1.567445 -0.319405 0.54791
C  0.067744 -0.168581 0.289331
C  2.396389 0.330945 -0.587341
C  -0.619283 0.980814 0.752271
C  -0.646658 -1.145108 -0.451106
C  -1.995928 1.152629 0.483115
C  -2.024635 -0.977284 -0.716211
C  -2.704731 0.172197 -0.250159
H  1.818012 0.255933 1.470826
H  2.005416 -0.008095 -1.567072
H  3.458597 0.013689 -0.495313
H  -0.066811 1.744983 1.310281
H  -0.108174 -2.029553 -0.809158
H  1.364289 -2.296413 1.258697
H  2.948098 -1.904845 0.776585
H  -2.515071 2.047466 0.845428
H  -2.567778 -1.740879 -1.285488
H  -3.773833 0.301851 -0.454609
H  2.480592 2.240265 -1.272932
