program: Gaussian 09
title: 000092492
version: EM64L-G09RevD.01
frameworkgroup: C1[X(C14H19NO)]
method: RPBEPBE
basis: SDD
operation: Freq
keyword: #p
keyword: freq=noraman
keyword: PBEPBE/SDD
title: #p freq=noraman PBEPBE/SDD
converged: YES YES NO NO
title: Mulliken charges:
elementType: O N C C C C C C C C C C C C C C H H H H H H H H H H H H H H H H H H H
charge: -0.441062 -0.047982 0.237553 -0.130371 -0.531170 -0.456051 0.318402 -0.589754 -0.473671 0.273333 -0.769205 -0.542998 -0.644571 -0.363194 0.270565 -0.427353 0.207729 0.209777 0.213703 0.208835 0.210890 0.245946 0.222456 0.205518 0.250405 0.212248 0.224717 0.210998 0.253881 0.224909 0.189238 0.224405 0.232118 0.218094 0.351661
chargesum: 0.00000
title: Mulliken charges with hydrogens summed into heavy atoms:
elementType: O N C C C C C C C C C C C C C C
charge: -0.089401 -0.047982 0.237553 0.077358 -0.107690 -0.036326 0.318402 -0.121352 -0.017748 0.273333 -0.121243 -0.289117 -0.006019 -0.131076 0.270565 -0.209259
polarizability: 1.96109781e+02 2.12568823e+00 1.53524501e+02 -8.46620256e+00 3.81486871e+00 1.11425355e+02
1716.lowfreq: -11.5654 -0.0006 -0.0003 -0.0002 5.9573 13.1571 56.0116 98.8802 119.6220
frequency: 55.8340 98.8689 119.6140 188.7210 211.8363 213.1859 236.5701 256.0931 267.0801 294.2660 312.7927 330.7853 342.3322 366.9482 373.3151 414.9269 433.4847 458.7078 474.1242 475.8434 492.7973 521.9754 576.5725 622.1263 683.7591 694.1807 704.9292 732.0140 779.7542 791.7253 793.1492 848.5107 881.5570 888.2523 906.7874 915.2996 934.6892 950.3818 968.5233 999.8828 1015.0280 1035.2072 1053.3363 1055.9464 1085.9944 1115.3814 1131.0765 1141.9100 1147.3353 1151.1820 1157.5645 1182.4324 1202.4700 1215.6140 1236.3839 1249.0517 1254.6162 1272.8055 1282.2427 1296.9591 1319.1854 1336.4002 1341.9919 1347.0486 1369.8739 1382.3527 1387.2251 1429.4038 1436.9768 1443.8890 1449.8771 1458.6944 1463.8058 1469.0128 1478.5292 1483.2086 1491.0516 1493.3922 1586.9558 1629.0526 2865.5053 2964.6422 2965.9321 2972.8190 2979.5209 2992.4545 3006.6659 3009.8266 3025.7816 3028.6868 3036.2712 3052.4973 3064.8470 3069.1690 3074.8332 3105.9762 3129.8307 3166.4036 3581.7127
redmass: 4.2894 3.7134 2.9152 3.1449 1.1214 1.9846 1.7265 1.7248 2.8321 2.6418 3.6856 2.9109 1.1113 2.7748 2.5495 3.5528 2.0645 2.7016 4.3290 3.3721 3.9417 3.5060 2.7610 3.4969 5.8247 3.5993 3.8821 3.5993 2.5021 2.0361 1.6832 2.2919 1.6148 2.1460 3.5292 1.8540 1.5265 2.1229 1.7273 1.8096 2.3218 1.8850 2.2129 1.7404 1.9049 1.4819 2.0470 1.3144 1.8239 1.3566 1.5393 1.6544 1.8065 2.2500 2.2339 1.8055 1.6785 1.6549 1.8446 1.7954 1.3359 1.5491 1.2744 1.5807 1.4152 4.9696 1.2378 1.1951 1.8197 1.0972 1.3382 1.0757 1.0827 1.0874 1.1102 1.1185 1.0608 2.3247 7.1143 6.4957 1.0557 1.0640 1.0588 1.0376 1.0594 1.0620 1.0837 1.0728 1.0974 1.0996 1.1020 1.1043 1.0984 1.1006 1.0998 1.0866 1.0969 1.0905 1.0660
irintensity: 0.1270 1.2243 1.2625 4.9349 0.3395 1.4658 0.2531 0.8934 1.4902 0.4626 0.1605 2.2979 137.6719 2.7608 0.9869 8.7136 3.7472 7.1497 7.7787 0.8467 3.4194 1.8821 8.2040 8.0431 0.6348 7.6348 5.5226 2.0654 11.6619 13.4163 26.8090 1.3454 14.0903 2.8261 43.7718 4.7039 2.8288 15.5291 11.1727 3.3378 9.6831 15.0575 6.1882 9.5102 21.7565 20.3226 1.5886 9.0520 92.7552 4.7820 80.3360 15.4211 8.6275 1.0709 10.5282 10.6247 10.2123 3.9125 14.3974 45.7713 9.6738 4.4319 1.2368 7.6562 15.5081 13.8392 11.7022 11.5752 2.5815 1.2635 12.7572 12.5593 19.6875 8.9427 16.4960 24.9499 6.0962 71.0439 29.3298 47.6515 103.4945 17.4822 29.4429 27.5658 51.6950 39.3801 57.1293 79.1806 13.3704 32.6702 33.0279 48.5867 56.8996 34.2367 36.2855 15.8819 26.1628 4.6607 33.3368
temp: 298.150 k
press: 1.00000 atm
elementType: 8 7 6 6 6 6 6 6 6 6 6 6 6 6 6 6 1 1 1 1 1 1 1 1 1 1 1 1 1 1 1 1 1 1 1
symmnumber: 1
zpe: 788255.6 jmol-1
zpe.correction: 0.300231 hartree
zpe.thermalcorrener: 0.314454 hartree
zpe.thermalcorrenthalpy: 0.315398 hartree
zpe.thermalcorrgfe: 0.260883 hartree
zpe.sumelectzpe: -673.647524 hartree
zpe.sumelectthermal: -673.633301 hartree
zpe.sumelectthermalent: -673.632357 hartree
zpe.sumelectthermalfe: -673.686872 hartree
dipole: 0.2024 -0.6791 -0.3866
dipole: 0.8072
quadrupole: -86.3802 -95.5905 -97.6089
quadrupole: 10.1691 -2.9498 1.6131
quadrupole: 6.8130 -2.3973 -4.4157 10.1691 -2.9498 1.6131
hfenergy: -673.9477551 hartree
pointgroup: C01 [X(C14H19N1O1)]
dipole: -0.0757373 0.2704101 -0.1483005 debye
polarizability: 196.0551095|1.5230886|153.5937294|8.9236824|-3.2415804|111.410798 unknown
InChI: InChI=1S/C14H19NO/c1-14-5-6-15(2)11(9-14)7-10-3-4-12(16)8-13(10)14/h3-4,8,11,16H,5-7,9H2,1-2H3
charge 0 multiplicity 1
35 atoms
O  4.238302 -0.820706 0.587418
N  -2.638281 0.764376 0.61203
C  -0.616088 -1.216273 -0.403292
C  -2.003462 0.891267 -0.736701
C  -1.619932 -0.486396 -1.342117
C  -1.307799 -1.373859 0.99774
C  0.646849 -0.343702 -0.242485
C  -0.747452 1.794542 -0.694592
C  -1.790261 -0.00938 1.560881
C  0.557646 1.077789 -0.351438
C  -0.301978 -2.617765 -0.978952
C  1.893939 -0.932208 0.077146
C  -4.040674 0.300109 0.556244
C  1.724909 1.853607 -0.149858
C  3.042162 -0.139496 0.276715
C  2.968034 1.268083 0.163358
H  -2.754799 1.384011 -1.383568
H  -2.524606 -1.113808 -1.465553
H  -1.172254 -0.349096 -2.346559
H  -0.60065 -1.842377 1.710356
H  -2.168261 -2.064584 0.88399
H  -0.936812 2.613033 0.026135
H  -0.633718 2.271566 -1.689665
H  -2.366724 -0.161986 2.492209
H  -0.910065 0.605978 1.8234
H  -1.245718 -3.160392 -1.176099
H  0.258441 -2.544601 -1.929063
H  0.288098 -3.234973 -0.27718
H  2.002623 -2.015873 0.172539
H  -4.477674 0.34963 1.570177
H  -4.186444 -0.741818 0.177022
H  -4.622389 0.977088 -0.095988
H  1.657135 2.945553 -0.235375
H  3.856993 1.893524 0.317643
H  4.982711 -0.180062 0.706282
