program: Gaussian 09
title: 000092463
version: EM64L-G09RevD.01
frameworkgroup: C1[X(C4H5NS)]
method: RPBEPBE
basis: SDD
operation: Freq
keyword: #pfreq=noraman
keyword: PBEPBE/SDD
title: #p freq=noraman PBEPBE/SDD
converged: NO NO NO NO
title: Mulliken charges:
elementType: S N C C C C H H H H H
charge: 0.105838 0.282070 -0.159195 -0.463939 -0.463634 -0.580819 0.268806 0.257730 0.247820 0.247916 0.257407
chargesum: 0.00000
title: Mulliken charges with hydrogens summed into heavy atoms:
elementType: S N C C C C
charge: 0.105838 0.282070 0.109612 0.041610 0.041689 -0.580819
polarizability: 1.19576968e+02 -6.27585809e-02 4.05283076e+01 5.20972784e+00 1.76411484e-04 3.92913917e+01
1716.lowfreq: -22.0766 -10.8200 -9.4155 -0.0027 -0.0011 0.0005 30.3524 64.9128 353.0405
frequency: 29.8935 64.8727 353.0405 367.4696 405.0327 413.2698 583.0930 769.0521 798.8923 846.2673 890.7736 1010.5747 1048.8171 1055.9422 1095.1218 1163.3249 1166.6754 1238.7686 1364.2414 1435.5464 1457.7527 2215.1431 3105.8060 3108.3578 3117.0358 3208.9759 3226.6772
redmass: 6.0246 4.3767 4.7447 5.2165 9.9021 4.2175 3.4614 1.1196 1.6945 3.5539 2.4094 2.1960 1.2238 1.1289 1.2862 2.5489 1.3760 2.0632 1.5411 1.0863 1.2625 12.5951 1.0514 1.0745 1.0767 1.1181 1.1154
irintensity: 0.7059 0.7223 4.0767 0.5251 1.7920 0.9648 19.0392 0.3482 17.0511 7.1036 2.9956 36.5338 19.9355 16.8730 0.1435 1.7383 0.8694 3.4686 33.7939 12.5768 8.6785 851.5746 13.4308 8.7144 14.8922 0.3486 18.2285
temp: 298.150 k
press: 1.00000 atm
elementType: 16 7 6 6 6 6 1 1 1 1 1
symmnumber: 1
zpe: 212578.9 jmol-1
zpe.correction: 0.080967 hartree
zpe.thermalcorrener: 0.087436 hartree
zpe.thermalcorrenthalpy: 0.088380 hartree
zpe.thermalcorrgfe: 0.048933 hartree
zpe.sumelectzpe: -607.747534 hartree
zpe.sumelectthermal: -607.741065 hartree
zpe.sumelectthermalent: -607.740121 hartree
zpe.sumelectthermalfe: -607.779568 hartree
dipole: 4.3961 0.0011 0.4099
dipole: 4.4151
quadrupole: -44.1042 -42.7854 -41.3984
quadrupole: -0.0027 1.3363 -0.0053
quadrupole: -1.3415 -0.0227 1.3642 -0.0027 1.3363 -0.0053
hfenergy: -607.8285012 hartree
pointgroup: C01 [X(C4H5N1S1)]
dipole: -1.6736952 -0.294654 0.3595389 debye
dipolederiv: -1.0671474 -0.1682078 0.1844957 -0.1666422 -0.1363383 0.0320295 0.2987605 0.0523457 -0.1693858 -1.8755245 -0.3036721 0.3560565 -0.3040725 -0.1936621 0.062424 0.5095527 0.0891156 -0.3263248 0.7337354 0.0749528 -0.1746861 0.07366 0.3214958 -0.0303504 -0.4074531 -0.0710319 0.2864961 -0.069508 0.0541793 -0.0558514 0.2490097 -0.0798857 0.074235 0.0249521 0.0965439 0.028952 0.028472 -0.0156752 -0.0266318 -0.2088403 -0.1745168 -0.089499 0.0594509 -0.0821253 0.0284692 2.2932411 0.4101151 -0.5696845 0.409178 0.0209701 -0.0996331 -0.7102099 -0.1242421 0.1413748 -0.1029142 -0.0412423 0.0132947 -0.0412054 0.1239358 0.0020762 0.0578619 0.0100751 -0.0908458 0.0758744 -0.0027863 0.0493944 0.0190053 0.0386311 0.0751617 0.02905 0.0934797 -0.0009633 -0.0751604 0.0722689 0.0791608 0.0617806 0.0498331 -0.0061617 0.0472723 -0.0350394 0.0514836 -0.0180308 -0.096945 0.0717015 -0.0870476 -0.0088615 0.0331932 0.0308632 0.0487046 0.0526777 0.0769624 0.0170125 0.0727503 -0.0048255 0.0383985 -0.0534754 0.0598995 -0.0778259 -0.0019336 unknown
polarizability: 115.0395196|13.0284163|42.8063083|-14.0502827|-2.455127|41.550839 unknown
InChI: InChI=1S/C4H5NS/c6-3-5-4-1-2-4/h4H,1-2H2
charge 0 multiplicity 1
11 atoms
S  3.130852 0.537924 -0.543286
N  0.450587 0.069179 0.27247
C  -0.866516 -0.163285 0.674024
C  -2.046215 0.407818 -0.141395
C  -1.778602 -1.101453 -0.142094
C  1.587704 0.26929 -0.073321
H  -0.993443 -0.184865 1.762232
H  -1.801498 0.97029 -1.046071
H  -2.898946 0.794534 0.42333
H  -2.447514 -1.761431 0.417055
H  -1.354611 -1.5425 -1.048146
