program: Gaussian 09
title: 000092510
version: EM64L-G09RevD.01
frameworkgroup: C1[X(C16H23NO)]
method: RPBEPBE
basis: SDD
operation: Freq
keyword: #p
keyword: freq=noraman
keyword: PBEPBE/SDD
title: #p freq=noraman PBEPBE/SDD
converged: YES YES NO NO
title: Mulliken charges:
elementType: O N C C C C C C C C C C C C C C C C H H H H H H H H H H H H H H H H H H H H H H H
charge: -0.440522 -0.062366 0.243025 -0.106701 -0.166285 -0.471944 0.315003 -0.607168 -0.426033 -0.459416 0.293051 -0.799214 -0.555551 -0.636035 -0.734618 -0.373811 0.261267 -0.430165 0.217006 0.211269 0.203358 0.210549 0.224354 0.227083 0.208338 0.208389 0.212370 0.197346 0.219243 0.245327 0.207039 0.258573 0.219292 0.185726 0.224325 0.221748 0.243225 0.210611 0.232149 0.218388 0.351774
chargesum: 0.00000
title: Mulliken charges with hydrogens summed into heavy atoms:
elementType: O N C C C C C C C C C C C C C C C C
charge: -0.088748 -0.062366 0.243025 0.110305 0.044984 -0.058036 0.315003 -0.155731 -0.009306 -0.049699 0.293051 -0.127604 -0.296978 -0.006692 -0.059034 -0.141663 0.261267 -0.211777
polarizability: 2.11033221e+02 4.40273894e+00 1.75921868e+02 -6.84802558e+00 1.28762128e+01 1.38983018e+02
1716.lowfreq: -19.9598 -6.5314 -0.0002 0.0005 0.0007 12.9281 48.5899 87.3075 104.6423
frequency: 48.5592 87.2875 104.6125 129.0245 140.7720 167.4461 182.6983 208.4451 218.0343 228.0006 239.1499 257.6466 288.6496 299.6769 327.6332 331.4750 341.5908 353.4767 366.1126 396.9970 413.0352 436.2755 463.3124 474.4879 499.7032 514.6058 557.3786 611.8967 637.6594 675.5349 683.7516 695.6009 730.9320 753.4796 778.1449 791.1395 821.0399 857.0284 879.6601 894.7623 918.3282 932.5068 938.6531 952.9487 977.2255 1006.4273 1026.9759 1037.9886 1052.2769 1062.2820 1069.1114 1086.3394 1105.3298 1114.3477 1116.4416 1136.9834 1142.3670 1150.2096 1155.9453 1185.3591 1200.1372 1204.8752 1214.3544 1228.7897 1235.9257 1259.3675 1271.6465 1277.5141 1290.6786 1311.8710 1325.7959 1331.9451 1337.4330 1349.1882 1358.8356 1375.1558 1380.0154 1389.8346 1394.1799 1430.8934 1434.5712 1448.6067 1451.4533 1462.3003 1470.0082 1477.2247 1480.6458 1483.8596 1489.8784 1491.7582 1493.7101 1501.8984 1585.2844 1627.5600 2849.4848 2864.4211 2952.4036 2971.7709 2980.4004 2980.8177 2982.2191 2985.2142 2988.3885 3003.1969 3004.3419 3005.3005 3025.3498 3043.9454 3064.3617 3065.9137 3070.8689 3081.3598 3094.9378 3106.1611 3130.0751 3163.6122 3582.9024
redmass: 4.1693 3.7187 3.1363 2.4195 2.8910 1.2608 2.2358 1.7155 2.0210 1.2273 1.9249 2.6143 2.7914 2.5880 2.9282 3.0441 1.1307 2.6418 3.0377 2.9067 2.9651 3.4556 3.3458 4.2348 3.1061 2.7936 3.2570 3.4474 2.8914 4.5267 4.1833 3.8150 3.5640 1.5981 2.8554 1.4100 1.9347 1.9334 1.6721 2.0509 1.5455 2.3015 1.8796 2.7167 1.7274 1.7762 1.8959 1.7176 2.0530 2.7067 2.3420 1.9934 1.4247 1.9474 1.8257 1.9575 1.9478 1.3785 1.6298 1.7845 1.8183 2.4337 1.5685 1.4712 1.6056 2.6083 1.4480 1.5556 1.4475 1.5303 1.6144 1.4444 1.4001 1.5686 1.3497 1.6066 3.7011 1.2371 1.2076 1.1999 2.1686 1.1044 1.2162 1.0753 1.0602 1.0858 1.0426 1.0551 1.6210 1.2555 1.0623 1.1838 7.0612 6.4264 1.0588 1.0692 1.0642 1.0797 1.0576 1.0543 1.0471 1.0630 1.0615 1.0765 1.0892 1.0867 1.0980 1.1024 1.1002 1.0968 1.0991 1.0996 1.0992 1.0866 1.0970 1.0901 1.0660
irintensity: 0.1035 0.6931 0.9289 0.7539 0.0948 0.5988 0.5195 2.4406 1.5121 0.2707 2.6849 2.2964 0.9190 0.7812 1.6144 0.9175 137.2549 1.7669 0.5523 8.1735 2.1745 4.3424 5.6160 3.3587 1.1787 5.9266 0.6484 5.5168 0.0942 3.1749 3.8997 5.9937 4.1606 8.3219 3.9548 39.3530 13.5415 18.3796 8.6760 7.8004 5.6791 24.9128 11.4739 3.1032 22.6599 12.7153 4.3716 21.8381 8.4642 1.2732 8.1964 5.9271 3.2654 0.0107 24.0702 34.8772 15.5411 66.6357 81.6347 12.5295 2.0352 15.2426 4.9803 2.4293 5.8300 19.4749 9.3278 18.5029 7.8745 17.2656 4.0475 9.8704 7.8238 1.1214 2.5185 19.6495 2.9157 20.7089 24.4652 5.6489 9.9913 4.9242 10.0954 16.7492 14.4402 4.8543 5.3584 7.2682 49.7800 26.6670 7.7439 28.1214 31.5740 47.4338 80.3403 124.0742 16.9294 26.7287 34.9438 12.8088 17.7477 105.8774 29.0330 71.0661 35.5859 50.7729 16.4203 53.4938 23.0272 47.3899 44.4055 47.2212 24.7308 15.9534 27.0850 4.7795 33.4097
temp: 298.150 k
press: 1.00000 atm
elementType: 8 7 6 6 6 6 6 6 6 6 6 6 6 6 6 6 6 6 1 1 1 1 1 1 1 1 1 1 1 1 1 1 1 1 1 1 1 1 1 1 1
symmnumber: 1
zpe: 933801.4 jmol-1
zpe.correction: 0.355666 hartree
zpe.thermalcorrener: 0.372812 hartree
zpe.thermalcorrenthalpy: 0.373757 hartree
zpe.thermalcorrgfe: 0.313049 hartree
zpe.sumelectzpe: -752.092852 hartree
zpe.sumelectthermal: -752.075705 hartree
zpe.sumelectthermalent: -752.074761 hartree
zpe.sumelectthermalfe: -752.135469 hartree
dipole: -0.2013 -1.7946 -0.7578
dipole: 1.9584
quadrupole: -104.2685 -104.7426 -109.6915
quadrupole: 5.6706 0.9798 2.0897
quadrupole: 1.9657 1.4916 -3.4573 5.6706 0.9798 2.0897
hfenergy: -752.4485178 hartree
pointgroup: C01 [X(C16H23N1O1)]
dipole: 0.1073864 0.7112339 -0.2761807 debye
polarizability: 211.0796867|3.1921718|176.3874007|7.5937122|-11.9765349|138.4710199 unknown
InChI: InChI=1S/C16H23NO/c1-4-16-7-8-17(3)15(11(16)2)9-12-5-6-13(18)10-14(12)16/h5-6,10-11,15,18H,4,7-9H2,1-3H3
charge 0 multiplicity 1
41 atoms
O  4.362059 -0.153255 0.851554
N  -2.520355 1.026547 0.506794
C  -0.485582 -1.085306 0.254265
C  -1.561509 -0.825085 -0.861476
C  -1.949668 0.677251 -0.824212
C  -1.092206 -0.665118 1.637835
C  0.744593 -0.18224 -0.01456
C  -0.727203 1.525451 -1.282162
C  -1.607905 0.786113 1.648365
C  -0.103954 -2.595578 0.334443
C  0.607497 1.058748 -0.708533
C  -2.818697 -1.717968 -0.785748
C  2.018949 -0.536081 0.493842
C  -3.170331 2.345198 0.560964
C  0.489036 -3.203747 -0.954572
C  1.746252 1.882378 -0.882878
C  3.139036 0.29874 0.31088
C  3.014647 1.522304 -0.386339
H  -1.075418 -1.002745 -1.843525
H  -2.766945 0.845665 -1.554888
H  -0.322851 -0.785814 2.425079
H  -1.927464 -1.348674 1.882365
H  -0.89072 2.593151 -1.032775
H  -0.67974 1.479846 -2.390521
H  -2.176001 0.966597 2.582091
H  -0.744083 1.496683 1.655866
H  -1.009241 -3.162322 0.625717
H  0.606727 -2.74583 1.170802
H  -2.57596 -2.79369 -0.840822
H  -3.390718 -1.525632 0.137599
H  -3.486733 -1.487684 -1.637428
H  2.175387 -1.470305 1.039869
H  -3.877795 2.447168 -0.282352
H  -2.461727 3.211356 0.520781
H  -3.745126 2.434456 1.501751
H  -0.238141 -3.182797 -1.786698
H  1.390282 -2.653593 -1.278284
H  0.776238 -4.258783 -0.791281
H  1.63352 2.833329 -1.418769
H  3.881308 2.179574 -0.534736
H  5.084342 0.496994 0.667498
