program: Gaussian 09
title: 000092467
version: EM64L-G09RevD.01
frameworkgroup: C1[X(C10H14N2O)]
method: RPBEPBE
basis: SDD
operation: Freq
keyword: #p
keyword: freq=noraman
keyword: PBEPBE/SDD
title: #p freq=noraman PBEPBE/SDD
converged: YES YES NO NO
title: Mulliken charges:
elementType: O N N C C C C C C C C C C H H H H H H H H H H H H H H
charge: -0.442233 -0.187915 -0.295964 -0.344567 -0.353362 -0.408790 -0.428114 0.467934 -0.354090 -0.351416 -0.387524 -0.367345 0.276495 0.216620 0.202288 0.214532 0.207290 0.189644 0.210010 0.212115 0.190379 0.269991 0.220414 0.239104 0.212837 0.243960 0.347707
chargesum: 0.00000
title: Mulliken charges with hydrogens summed into heavy atoms:
elementType: O N N C C C C C C C C C C
charge: -0.094525 -0.187915 -0.025973 0.074342 0.068460 -0.009135 -0.025620 0.467934 -0.133676 -0.112313 -0.174688 -0.123386 0.276495
polarizability: 1.86823341e+02 -1.86846173e+00 1.21988583e+02 1.48486784e+00 -5.47872073e+00 7.27168497e+01
1716.lowfreq: -14.2237 -11.9889 -0.0003 0.0001 0.0006 5.7326 51.4001 59.2143 105.6346
frequency: 51.3575 59.1516 105.6324 181.0329 237.4853 257.0017 276.2869 305.4317 341.4618 369.1585 387.6102 411.7949 444.1495 453.4213 473.1438 518.2659 556.2067 635.6001 678.7784 686.5320 708.5179 784.5988 801.3834 812.1008 845.6473 864.2807 905.0167 927.6957 932.2162 937.7883 993.3220 1043.7381 1051.7965 1069.9419 1097.0148 1107.1423 1141.8952 1146.6814 1167.6216 1184.4694 1201.4529 1230.4152 1242.8569 1244.0310 1286.3036 1315.7131 1327.1677 1338.4263 1350.8886 1370.2322 1385.8704 1389.8421 1431.9740 1445.6229 1455.3637 1456.3526 1462.6535 1469.5511 1507.8289 1588.7559 1635.0306 2871.2205 2876.3974 2903.8772 2917.5028 3040.2069 3043.3598 3050.7418 3085.1441 3109.2636 3150.0122 3150.4016 3171.7677 3463.6247 3587.4136
redmass: 4.4906 3.1432 4.4082 4.6815 2.4405 2.2659 4.8681 1.1217 3.7406 3.9248 2.2435 2.9769 3.4240 2.9478 2.4617 2.3546 2.5509 6.8781 2.7777 1.8893 3.6462 1.4744 4.3459 1.6314 1.5322 3.2077 1.4032 1.9352 1.9735 1.9242 2.7690 2.3693 1.7516 1.8042 2.2141 1.5449 2.0001 1.4681 3.4848 1.1207 1.1021 1.4939 1.6574 1.9932 1.2887 1.3457 1.2706 1.3202 1.9958 1.6156 2.6400 1.6384 3.4334 1.3535 1.0877 1.0785 1.1044 1.1095 2.7045 6.2754 6.5105 1.0712 1.0694 1.0685 1.0704 1.0897 1.0916 1.0905 1.0899 1.0888 1.0891 1.0918 1.0962 1.0754 1.0660
irintensity: 0.4561 2.0457 0.1969 1.1866 15.4242 4.7487 0.9074 142.2097 1.6850 6.4891 2.4246 1.7437 16.6661 4.9361 53.1207 23.7152 37.5941 1.1653 76.1938 32.0868 1.4655 19.0439 35.0710 67.0077 2.0081 2.5635 0.7589 10.2332 23.0066 15.7421 3.6196 18.0199 1.5560 3.6609 17.3492 43.3105 72.5378 164.9668 17.8290 0.3309 7.7527 156.5452 31.7477 5.3668 6.0987 13.7748 35.1318 5.0578 7.7887 13.9723 39.8224 15.5621 11.8822 2.8414 7.4594 0.8643 60.9723 2.8592 282.3831 1.4920 4.5825 69.3830 107.2318 71.7762 116.3697 51.0819 58.7007 27.6248 22.9884 24.7517 12.8542 20.7781 7.5480 1.5405 36.3806
temp: 298.150 k
press: 1.00000 atm
elementType: 8 7 7 6 6 6 6 6 6 6 6 6 6 1 1 1 1 1 1 1 1 1 1 1 1 1 1
symmnumber: 1
zpe: 595199.8 jmol-1
zpe.correction: 0.226700 hartree
zpe.thermalcorrener: 0.238330 hartree
zpe.thermalcorrenthalpy: 0.239274 hartree
zpe.thermalcorrgfe: 0.189058 hartree
zpe.sumelectzpe: -573.178060 hartree
zpe.sumelectthermal: -573.166430 hartree
zpe.sumelectthermalent: -573.165486 hartree
zpe.sumelectthermalfe: -573.215702 hartree
dipole: 2.2458 1.6850 -0.7748
dipole: 2.9126
quadrupole: -70.8465 -68.6939 -83.0275
quadrupole: -7.9548 -1.5976 -0.7942
quadrupole: 3.3428 5.4954 -8.8382 -7.9548 -1.5976 -0.7942
hfenergy: -573.40476 hartree
pointgroup: C01 [X(C10H14N2O1)]
dipole: -0.8824151 0.6749305 0.2808524 debye
polarizability: 186.8278002|1.7710764|122.2975679|1.5694654|3.7792211|72.4034057 unknown
InChI: InChI=1S/C10H14N2O/c13-10-3-1-9(2-4-10)12-7-5-11-6-8-12/h1-4,11,13H,5-8H2
charge 0 multiplicity 1
27 atoms
O  4.602857 -0.076512 0.032432
N  -1.096118 0.033887 0.100063
N  -3.949405 -0.0208 -0.16549
C  -1.82369 1.123225 -0.602503
C  -1.822325 -1.253274 0.060075
C  -3.249379 1.275421 -0.043392
C  -3.256332 -1.078572 0.598133
C  0.327909 0.017538 0.046089
C  1.075466 1.212579 0.262161
C  1.06545 -1.184929 -0.173689
C  2.484209 1.20875 0.254751
C  2.475087 -1.195061 -0.164806
C  3.191419 0.000954 0.044477
H  -1.893965 0.898532 -1.691883
H  -1.27946 2.073143 -0.484366
H  -1.295796 -1.982658 0.700405
H  -1.870941 -1.663287 -0.976347
H  -3.177358 1.62914 1.015161
H  -3.791536 2.03867 -0.631041
H  -3.803357 -2.031795 0.480235
H  -3.187891 -0.84546 1.68973
H  -4.950991 0.040891 0.054324
H  0.556575 2.153847 0.469442
H  0.544105 -2.125314 -0.373115
H  3.026701 2.147608 0.430094
H  3.030279 -2.122637 -0.334938
H  4.998389 0.816116 0.189098
