program: Gaussian 09
title: 000092464
version: EM64L-G09RevD.01
frameworkgroup: C1[X(C9H18N2)]
method: RPBEPBE
basis: SDD
operation: Freq
keyword: #pfreq=noraman
keyword: PBEPBE/SDD
title: #p freq=noraman PBEPBE/SDD
converged: NO YES NO NO
title: Mulliken charges:
elementType: N N C C C C C C C C C H H H H H H H H H H H H H H H H H H
charge: -0.570088 -0.569786 -0.195336 -0.194036 -0.066945 0.015567 -0.528663 -0.486526 -0.472848 -0.491435 -0.541307 0.226336 0.241853 0.189926 0.255299 0.223503 0.218219 0.206032 0.222558 0.218301 0.213313 0.215819 0.190433 0.239137 0.177959 0.273861 0.257307 0.266801 0.264747
chargesum: 0.00000
title: Mulliken charges with hydrogens summed into heavy atoms:
elementType: N N C C C C C C C C C
charge: -0.038919 -0.038238 0.031000 0.047817 0.122980 0.270866 -0.086941 -0.057936 -0.041234 -0.085182 -0.124212
polarizability: 1.10687091e+02 -1.76899566e+00 1.09521221e+02 1.85733741e-01 -7.19066346e-01 9.15464757e+01
1716.lowfreq: -13.1934 -0.0007 0.0002 0.0005 6.0058 18.5206 64.5228 94.8019 122.8387
frequency: 64.4761 94.7777 122.7820 153.8998 201.2006 217.4622 240.4991 273.6355 298.1975 335.9026 402.8440 451.7670 460.6649 520.8963 563.5016 603.5087 608.8293 737.8008 742.7815 788.4307 808.3790 868.1275 887.3310 899.6703 925.9550 934.5797 951.2277 968.0847 977.8511 1006.8871 1021.3344 1039.2257 1049.8338 1054.0793 1090.9241 1100.3516 1120.6567 1139.5579 1148.1456 1155.2315 1173.0260 1194.3900 1213.0188 1234.5906 1247.5584 1262.7119 1272.9074 1275.9507 1285.8602 1294.9226 1305.6065 1310.7048 1329.5295 1345.0791 1375.3926 1377.1617 1467.8455 1468.9468 1481.0172 1484.8963 1500.2332 1636.9574 1637.8735 2846.0922 2860.3150 2941.4006 2989.1167 3000.5121 3002.4883 3004.7261 3013.8158 3030.8251 3036.2362 3042.6340 3055.8892 3064.8385 3070.9673 3450.8001 3456.8062 3577.9487 3583.4956
redmass: 3.2111 3.1196 2.2074 3.0362 2.2244 1.1794 1.2914 1.9544 1.9238 3.1212 3.0243 2.2800 2.2440 2.3580 2.2702 1.5599 1.3278 3.2940 3.3153 2.7307 1.3216 2.1926 2.6049 2.1182 1.8573 2.1408 1.7666 1.7374 1.6629 1.7432 2.1185 1.6253 1.5767 1.9592 2.1251 1.6083 1.4252 1.3157 1.4202 1.5685 2.0071 1.6149 1.3315 1.3767 1.5147 1.3616 1.2484 1.4536 1.4853 1.3719 1.4830 1.4580 1.4019 1.4694 1.4591 1.4247 1.0846 1.0932 1.0862 1.0892 1.0873 1.0948 1.0939 1.0714 1.0711 1.0835 1.0593 1.0611 1.0819 1.0637 1.0880 1.0882 1.0893 1.1007 1.0911 1.1039 1.1054 1.0448 1.0446 1.0974 1.0975
irintensity: 0.2715 0.8429 3.0181 1.9524 5.1984 49.8761 25.2589 19.2016 7.5471 3.7547 2.2373 4.8947 11.2632 30.2908 44.1493 176.1112 166.7941 2.3270 2.9394 1.4136 3.9425 4.8062 2.2572 1.0013 0.4921 1.6685 5.9720 1.9572 1.8364 0.8274 8.7197 3.7536 2.3054 1.1015 11.2763 9.7540 2.2579 13.4887 9.3673 1.7466 2.0039 2.4348 1.1857 1.2912 0.8699 0.8779 8.1314 1.3217 2.9552 7.8799 0.5793 3.1249 0.2734 2.0525 9.6469 11.4532 1.2312 11.9728 9.7001 8.6792 7.1768 28.7361 58.8934 95.7490 120.6495 36.4676 29.8452 25.9093 4.8618 75.8661 65.0322 33.2014 89.9510 11.9698 19.0385 50.2860 81.2761 1.6128 2.0570 0.5388 0.0384
temp: 298.150 k
press: 1.00000 atm
elementType: 7 7 6 6 6 6 6 6 6 6 6 1 1 1 1 1 1 1 1 1 1 1 1 1 1 1 1 1 1
symmnumber: 1
zpe: 689266.6 jmol-1
zpe.correction: 0.262528 hartree
zpe.thermalcorrener: 0.273887 hartree
zpe.thermalcorrenthalpy: 0.274831 hartree
zpe.thermalcorrgfe: 0.226033 hartree
zpe.sumelectzpe: -462.335685 hartree
zpe.sumelectthermal: -462.324325 hartree
zpe.sumelectthermalent: -462.323381 hartree
zpe.sumelectthermalfe: -462.372180 hartree
dipole: -0.4021 -0.7266 -1.3763
dipole: 1.6074
quadrupole: -61.5196 -68.1920 -69.4286
quadrupole: 3.7400 2.0829 -4.5233
quadrupole: 4.8605 -1.8120 -3.0485 3.7400 2.0829 -4.5233
hfenergy: -462.5982124 hartree
pointgroup: C01 [X(C9H18N2)]
dipole: -0.1016746 -0.320776 -0.5354435 debye
polarizability: 111.2073082|-1.4651885|108.9430401|0.6337419|-1.1241613|91.6044398 unknown
InChI: InChI=1S/C9H18N2/c10-4-8-6-1-2-7(3-6)9(8)5-11/h6-9H,1-5,10-11H2
charge 0 multiplicity 1
29 atoms
N  -3.120565 -0.460776 -0.159066
N  -0.073419 3.107684 0.119639
C  0.597352 -1.617253 -0.135859
C  1.171499 0.379208 0.807999
C  -0.656322 -0.724011 -0.408809
C  -0.28983 0.632098 0.3048
C  1.067587 -1.106953 1.259543
C  1.761498 -1.120769 -1.045225
C  2.155746 0.259898 -0.396923
C  -1.971144 -1.351414 0.10514
C  -0.500419 1.876647 -0.576869
H  0.399126 -2.700462 -0.220637
H  1.49641 1.09315 1.583844
H  -0.763575 -0.564124 -1.504505
H  -0.94476 0.762249 1.18781
H  0.327816 -1.265625 2.064843
H  2.036305 -1.538699 1.57188
H  1.444731 -1.019058 -2.099605
H  2.610255 -1.829287 -1.019346
H  3.20202 0.248425 -0.038708
H  2.063713 1.099801 -1.108873
H  -1.901277 -1.497093 1.200587
H  -2.07946 -2.368644 -0.348377
H  -1.584119 1.955037 -0.782539
H  0.005818 1.721434 -1.563878
H  -3.97694 -0.70531 0.347172
H  -3.29959 -0.308897 -1.157445
H  -0.410837 3.975884 -0.306047
H  0.931382 3.144661 0.318056
