program: Gaussian 09
title: 000092545
version: EM64L-G09RevD.01
frameworkgroup: C1[X(C20H23N7O2)]
method: RPBEPBE
basis: SDD
operation: Freq
keyword: #p
keyword: freq=noraman
keyword: PBEPBE/SDD
title: #p freq=noraman PBEPBE/SDD
converged: YES YES NO NO
title: Mulliken charges:
elementType: O O N N N N N N N C C C C C C C C C C C C C C C C C C C C H H H H H H H H H H H H H H H H H H H H H H H
charge: -0.269658 -0.295437 -0.332505 -0.374774 -0.100848 -0.107537 -0.130477 -0.042191 -0.082951 0.355736 0.062069 -0.112775 0.074542 0.096248 -0.404344 -0.370918 -0.765118 -0.244316 -0.265931 -0.318009 0.070932 -0.494530 -0.489019 0.265018 -0.344539 -0.344753 -0.203428 -0.238208 -0.154911 0.399097 0.247986 0.219890 0.369664 0.248541 0.238501 0.245055 0.253105 0.255041 0.189308 0.216895 0.204253 0.201584 0.197600 0.199377 0.236685 0.207985 0.205740 0.242372 0.253835 0.256412 0.235400 0.238302
chargesum: 0.00000
title: Mulliken charges with hydrogens summed into heavy atoms:
elementType: O O N N N N N N N C C C C C C C C C C C C C C C C C C C C
charge: -0.269658 -0.295437 0.066592 -0.005111 -0.100848 -0.107537 -0.130477 -0.042191 -0.082951 0.355736 0.062069 -0.112775 0.074542 0.096248 0.063532 0.116125 -0.011917 0.161887 0.139906 -0.318009 0.070932 0.139133 0.167079 0.265018 -0.090704 -0.088341 0.031972 0.000094 -0.154911
polarizability: 6.08376804e+02 9.67646576e+00 3.17321588e+02 1.17135748e+01 -3.75417361e+01 1.57027289e+02
1716.lowfreq: -5.2352 -0.0008 -0.0004 0.0010 1.9686 4.3958 15.2030 21.0106 27.1714
frequency: 15.0811 20.8128 27.1527 33.8862 38.1628 41.8656 57.3600 67.2480 77.1446 85.9614 88.6503 101.8013 104.5088 120.1115 131.4258 143.5121 145.9288 175.2814 178.8612 182.2553 207.6076 213.1413 220.9482 229.5283 238.9485 251.5341 267.1104 284.2758 290.5116 297.9506 332.4207 356.3576 390.6641 394.4869 399.3276 430.6815 434.6635 459.3974 489.2675 506.5646 511.6679 522.6011 544.6047 552.0003 566.8428 574.0582 597.1649 622.0468 657.7033 678.3366 698.4394 704.7982 714.9972 755.8106 757.8632 766.2851 774.9593 791.2697 795.4556 805.6917 870.3297 883.5251 890.7290 897.8369 935.5035 966.3609 982.0500 988.2366 996.1093 1000.3143 1034.3364 1034.7763 1058.0605 1067.2397 1072.3342 1083.1789 1089.9488 1104.3847 1112.4763 1119.6172 1122.7911 1136.9633 1156.9311 1162.9895 1164.5505 1171.2986 1185.3906 1188.0376 1202.2623 1215.6609 1225.8322 1248.7752 1271.5659 1286.7260 1309.6757 1324.3502 1338.5551 1351.6205 1361.6897 1362.3762 1370.7417 1373.2339 1389.5956 1411.9887 1427.2269 1433.3331 1436.3260 1438.5363 1439.9819 1447.1968 1457.9396 1458.6821 1460.8116 1463.6301 1465.0481 1466.5693 1469.0131 1481.2870 1483.4821 1492.4778 1524.6556 1553.8782 1568.7420 1577.3681 1602.0930 2141.2140 2141.8766 2913.7222 2923.6605 2932.8025 2940.7505 2980.0378 2980.8431 2992.0976 2997.5636 3000.9178 3015.0808 3024.6818 3077.9021 3089.2985 3092.8800 3102.9368 3105.4649 3113.0263 3138.2127 3148.0142 3162.8938 3175.3059 3438.6368 3498.0576
redmass: 5.3567 4.2080 4.9123 5.5263 4.3199 4.1203 5.2448 2.4296 4.4040 2.4869 4.1220 3.4975 3.6345 7.1822 4.5795 6.2052 4.6909 2.9418 1.7688 2.5247 3.7801 2.4821 1.7414 1.7391 5.2893 5.0837 2.3397 4.6474 2.5701 3.2755 3.8606 3.2304 5.7161 4.8659 4.8899 8.3577 3.9953 4.7412 8.8349 3.5127 3.8039 3.4436 6.7579 5.3960 8.1884 4.3774 4.7150 8.2216 3.3543 6.2531 1.1567 6.0951 8.8648 4.0168 3.8241 1.7796 1.3350 2.3861 2.7113 2.8193 5.7461 2.7870 1.4676 2.4602 2.8623 1.3837 2.9068 3.5665 1.3444 2.7801 2.2971 1.5773 2.0242 3.2547 3.6009 2.5877 1.9476 2.2394 2.0303 1.5454 1.5072 2.3549 1.7393 1.8494 1.8057 1.4102 1.8855 2.6968 1.2310 1.8370 1.8178 1.7691 1.5461 1.4763 1.8513 2.0828 6.6118 1.6997 1.3799 1.3220 5.8281 1.5215 1.6519 1.7689 2.1105 1.9129 1.1667 1.1701 1.1860 1.0498 1.3772 1.4412 1.0527 1.6008 1.1297 1.0707 1.0976 1.1236 1.0767 3.1209 2.6669 6.0690 7.4780 5.4041 6.3103 12.6071 12.6022 1.0511 1.0423 1.0453 1.0439 1.0810 1.0993 1.1026 1.0364 1.0935 1.1034 1.0610 1.0946 1.0943 1.1037 1.0967 1.1021 1.0980 1.0856 1.0904 1.0946 1.1007 1.0788 1.0774
irintensity: 1.6586 1.0827 0.3990 0.5132 0.9706 0.9721 0.0086 7.5063 3.9129 5.3494 4.4042 3.8903 2.2574 7.8641 0.5192 2.8679 1.1268 2.7123 2.0918 1.4422 12.5979 2.4079 4.6513 5.2140 3.3072 5.7576 3.2056 3.8528 5.2280 0.2761 0.5145 1.6515 0.8811 0.0170 1.2390 2.0624 5.3987 11.7320 8.7248 1.2381 7.3652 3.3771 2.0359 2.3778 11.7021 1.5686 1.3970 1.2075 7.1724 10.9411 121.2535 2.2772 0.2161 1.7175 2.0079 0.7193 116.1429 47.0332 10.7160 12.6375 8.6982 6.6791 0.1314 1.0593 8.0859 3.2945 19.3428 15.8088 0.2422 21.2624 14.7312 4.3113 5.2332 124.0920 138.3484 52.1485 6.5261 14.5870 13.2208 6.6286 2.5417 13.8842 46.7763 29.7092 11.7406 3.6963 3.2107 6.6105 11.3341 12.7704 31.7544 202.5789 46.0406 7.6998 174.1894 184.5233 483.4925 15.9871 10.3647 25.8283 52.5399 47.9832 131.3636 27.1586 18.8457 19.8572 7.1377 21.6944 11.5001 12.3403 30.6549 29.9362 12.9451 6.2863 34.3959 29.3346 45.2879 4.8666 5.4560 92.0218 146.5128 68.8887 1114.5701 436.9861 10.3569 207.3221 15.1255 47.4852 118.3568 40.9492 132.9614 4.0388 59.0410 61.3360 6.2620 138.2214 61.6176 53.4824 4.6257 9.7492 7.6519 24.5481 13.7560 21.6667 3.2296 5.6010 14.4485 34.0646 145.7895 226.6212
temp: 298.150 k
press: 1.00000 atm
elementType: 8 8 7 7 7 7 7 7 7 6 6 6 6 6 6 6 6 6 6 6 6 6 6 6 6 6 6 6 6 1 1 1 1 1 1 1 1 1 1 1 1 1 1 1 1 1 1 1 1 1 1 1
symmnumber: 1
zpe: 1068995.6 jmol-1
zpe.correction: 0.407159 hartree
zpe.thermalcorrener: 0.436758 hartree
zpe.thermalcorrenthalpy: 0.437703 hartree
zpe.thermalcorrgfe: 0.343217 hartree
zpe.sumelectzpe: -1307.450881 hartree
zpe.sumelectthermal: -1307.421281 hartree
zpe.sumelectthermalent: -1307.420337 hartree
zpe.sumelectthermalfe: -1307.514823 hartree
dipole: -1.9010 2.8118 1.8246
dipole: 3.8535
quadrupole: -121.3213 -178.0039 -170.0337
quadrupole: -32.7702 -0.4524 4.1306
quadrupole: 35.1317 -21.5509 -13.5807 -32.7702 -0.4524 4.1306
hfenergy: -1307.8580395 hartree
pointgroup: C01 [X(C20H23N7O2)]
dipole: 0.7493015 -1.0856996 0.7472273 debye
polarizability: 605.678836|-1.4107485|321.3809781|-38.1828739|27.1021321|155.6658676 unknown
InChI: InChI=1S/C20H23N7O2/c1-14-16(13-22)19(23-8-10-28-2)25-20(24-9-11-29-3)18(14)27-26-17-7-5-4-6-15(17)12-21/h4-7,23-24H,8-11H2,1-3H3
charge 0 multiplicity 1
52 atoms
O  -0.225803 -4.122147 1.186824
O  6.596136 0.331465 -0.72603
N  -0.319162 -1.747253 -0.624995
N  3.847631 0.356194 -0.711245
N  1.755054 -0.682611 -0.655102
N  -1.673783 0.503845 -0.076279
N  -2.430985 1.548613 0.218178
N  3.549053 3.771688 0.028547
N  -3.317986 -2.210579 -0.837495
C  0.495097 1.846933 -0.035265
C  0.400209 -0.604334 -0.487882
C  -0.297333 0.654786 -0.181712
C  2.494148 0.448073 -0.531156
C  1.898086 1.740051 -0.20806
C  0.270807 -3.055102 -0.926998
C  4.558112 -0.88299 -1.046014
C  -0.113285 3.190381 0.289481
C  0.877225 -3.751144 0.300212
C  5.909021 -0.902949 -0.325774
C  2.766309 2.867302 -0.073577
C  -3.82342 1.261405 0.269302
C  0.238005 -4.720434 2.434311
C  7.862698 0.537258 -0.024429
C  -4.47386 0.015783 -0.047919
C  -4.632584 2.362498 0.667809
C  -5.891311 -0.078998 0.048319
C  -6.031169 2.252101 0.761194
C  -6.667867 1.024776 0.450041
C  -3.769674 -1.16087 -0.472897
H  -1.338269 -1.692608 -0.499986
H  -0.531377 -3.691972 -1.336732
H  1.063213 -2.929994 -1.686027
H  4.429799 1.199135 -0.658212
H  3.929758 -1.738743 -0.750441
H  4.726441 -0.943815 -2.139737
H  0.659937 3.973753 0.345759
H  -0.667828 3.147738 1.242726
H  -0.869455 3.468494 -0.464727
H  1.432635 -4.659692 -0.029097
H  1.588096 -3.069662 0.814857
H  5.767424 -0.921233 0.777089
H  6.496468 -1.795695 -0.630752
H  0.80826 -5.657822 2.253383
H  0.880076 -4.019412 3.01046
H  -0.665508 -4.951917 3.019888
H  7.710835 0.600829 1.073498
H  8.582084 -0.279176 -0.243623
H  8.267204 1.491835 -0.39407
H  -4.118629 3.300472 0.899683
H  -6.372169 -1.03155 -0.198224
H  -6.626883 3.116542 1.072963
H  -7.756385 0.931149 0.517631
