program: Gaussian 09
title: 000009529
version: EM64L-G09RevD.01
frameworkgroup: C1[X(C11H17OPS2)]
method: RPBEPBE
basis: SDD
operation: Freq
keyword: #p
keyword: freq=noraman
keyword: PBEPBE/SDD
title: #p freq=noraman PBEPBE/SDD
converged: YES YES NO NO
title: Mulliken charges:
elementType: S S P O C C C C C C C C C C C H H H H H H H H H H H H H H H H H
charge: -0.115436 -0.215200 0.116667 -0.272721 -0.636318 0.055647 -0.191512 -0.267461 -0.295071 0.449049 -0.392009 -0.370414 -0.210007 -0.800712 -0.675476 0.253527 0.305610 0.221857 0.203787 0.233050 0.285033 0.239139 0.240295 0.092334 0.187985 0.194808 0.230389 0.227944 0.243061 0.204629 0.230759 0.226768
chargesum: 0.00000
title: Mulliken charges with hydrogens summed into heavy atoms:
elementType: S S P O C C C C C C C C C C C
charge: -0.023102 -0.215200 0.116667 -0.272721 -0.077182 0.055647 0.234132 -0.034411 -0.010038 0.449049 -0.152870 -0.130119 0.172787 -0.099318 -0.013320
polarizability: 1.96563180e+02 -2.73208349e+01 1.86338333e+02 -4.13610516e-01 8.74536707e+00 1.81729678e+02
1716.lowfreq: -35.5297 -15.8634 -0.0028 0.0008 0.0019 4.1187 9.2887 20.1729 28.8400
frequency: -35.4382 19.0170 27.7398 42.8434 58.5635 65.8375 82.5385 101.2146 121.0262 125.4938 133.2016 142.7622 153.7184 205.2583 222.5748 236.2041 268.0329 298.8029 331.0706 358.1904 391.4022 400.3048 404.9725 465.6172 517.1559 541.0331 609.2567 630.0691 687.2619 721.6622 739.6235 785.9486 793.9007 817.1615 823.4416 847.4473 861.4530 957.0349 986.6566 990.8277 993.4745 1002.0938 1012.3100 1047.5174 1059.5589 1066.3039 1082.0332 1121.6639 1125.6584 1134.3380 1172.7115 1197.0524 1222.1552 1241.6246 1251.7244 1268.8562 1302.0453 1340.4178 1363.1727 1389.9237 1398.0389 1398.4475 1405.9780 1428.0891 1459.5034 1468.4161 1473.3732 1475.6114 1484.5500 1485.6929 1494.7377 1574.6744 1606.8893 2409.5620 2923.2685 2933.5726 2974.0185 2979.2796 2990.4389 2995.0858 3035.0249 3061.1845 3090.7110 3093.0554 3102.1686 3109.9383 3118.3250 3123.4133 3140.3416 3145.2486
redmass: 1.0115 4.3745 3.6876 1.8371 4.4697 4.5693 4.1900 1.8863 2.1228 3.4626 3.8980 4.3326 4.1950 3.3948 5.6324 1.1654 4.4433 4.9533 4.3282 2.9836 5.3443 2.8636 6.3872 3.6361 3.0722 7.7425 4.3174 6.7763 1.2593 3.1367 3.8013 1.7302 2.3807 1.0924 1.3742 2.8073 1.2550 1.3326 1.4169 1.3584 3.6295 2.2590 1.8196 1.5891 3.2842 5.1902 3.3039 2.2357 1.3374 1.3703 1.2390 1.1173 2.9389 1.2850 1.1456 1.1221 1.2843 1.2256 4.2200 1.2314 2.9828 1.2988 1.3900 1.0982 1.0408 1.0922 1.0566 1.0699 1.0843 2.2451 1.0782 5.9670 6.1030 1.0383 1.0557 1.0566 1.1066 1.0389 1.1047 1.0358 1.0585 1.0947 1.1000 1.0991 1.1010 1.1033 1.0869 1.0882 1.0960 1.0974
irintensity: 0.6431 0.5623 0.0755 2.1850 2.0708 1.9386 1.0910 13.0164 5.1831 3.0278 5.3931 15.4762 2.3767 0.2941 0.8922 0.7302 1.3051 2.7339 6.4176 3.9157 20.4735 0.4291 26.3730 5.1988 66.3765 58.2603 15.5376 0.1387 3.9856 5.8711 7.7556 9.8830 11.9302 8.5193 30.8878 13.4172 5.8043 0.4740 0.1285 0.5637 28.2062 13.3621 5.2328 23.7209 8.6129 184.7299 38.6601 33.1834 7.6933 7.9825 0.5101 8.6261 1.6431 5.8403 0.1805 0.4860 6.2450 33.1939 3.9082 18.6578 10.6508 12.7715 4.5073 13.5285 11.3128 18.1773 12.9984 11.3812 1.1322 16.1313 6.0974 0.9263 20.7836 24.3305 36.3295 68.4235 58.7891 26.5753 23.1743 25.8403 5.6306 19.5245 14.9027 33.7385 35.3392 3.4229 7.7680 3.0583 21.8956 13.0940
temp: 298.150 k
press: 1.00000 atm
elementType: 16 16 15 8 6 6 6 6 6 6 6 6 6 6 6 1 1 1 1 1 1 1 1 1 1 1 1 1 1 1 1 1
symmnumber: 1
zpe: 662369.9 jmol-1
zpe.correction: 0.252283 hartree
zpe.thermalcorrener: 0.270680 hartree
zpe.thermalcorrenthalpy: 0.271624 hartree
zpe.thermalcorrgfe: 0.202543 hartree
zpe.sumelectzpe: -1640.779395 hartree
zpe.sumelectthermal: -1640.760999 hartree
zpe.sumelectthermalent: -1640.760054 hartree
zpe.sumelectthermalfe: -1640.829136 hartree
dipole: 1.5160 -6.1293 -1.3383
dipole: 6.4543
quadrupole: -100.4093 -122.9230 -112.0840
quadrupole: -4.2884 -2.5931 -3.2091
quadrupole: 11.3961 -11.1175 -0.2786 -4.2884 -2.5931 -3.2091
hfenergy: -1641.0316787 hartree
pointgroup: C01 [X(C11H17O1P1S2)]
dipole: -0.6059754 2.429859 -0.4203122 debye
polarizability: 197.1645622|-26.8716935|186.7009625|-0.3473502|-9.4640849|180.7656669 unknown
InChI: InChI=1S/C11H16OPS.HS/c1-3-12-8-9-13(14)11-6-4-10(2)5-7-11;/h4-7H,3,8-9H2,1-2H3;1H
charge 0 multiplicity 1
32 atoms
S  -0.276903 -3.218275 -1.848957
S  0.401516 -2.820635 1.748888
P  0.188824 -1.792752 -0.050706
O  3.517825 0.613167 -0.205916
C  1.754255 -0.93948 -0.640818
C  -1.182127 -0.530134 -0.064909
C  2.327667 0.018302 0.410342
C  -1.32252 0.394277 -1.128264
C  -2.094409 -0.505845 1.013845
C  -3.301362 1.373084 -0.030989
C  -2.371073 1.338016 -1.103304
C  -3.140783 0.439978 1.026085
C  4.252323 1.486269 0.727497
C  -4.449569 2.365019 -0.02971
C  5.47103 2.029243 -0.016852
H  1.534003 -0.401937 -1.579662
H  2.479284 -1.739706 -0.864367
H  2.595688 -0.541236 1.332038
H  1.59593 0.811446 0.682756
H  -0.623748 0.394179 -1.973692
H  -1.968368 -1.221657 1.835161
H  -2.469477 2.055073 -1.926902
H  -3.842523 0.454167 1.868352
H  -0.523056 -2.183309 -2.745546
H  3.588869 2.312646 1.067473
H  4.557004 0.899955 1.622409
H  -4.747522 2.639384 0.997082
H  -4.189185 3.290653 -0.572064
H  -5.340875 1.933683 -0.525516
H  6.061124 2.692241 0.641747
H  6.118363 1.200703 -0.351843
H  5.157493 2.604481 -0.904959
