program: Gaussian 09
title: 000092461
version: EM64L-G09RevD.01
frameworkgroup: C1[X(C10H17NO)]
method: RPBEPBE
basis: SDD
operation: Freq
keyword: #p
keyword: freq=noraman
keyword: PBEPBE/SDD
title: #p freq=noraman PBEPBE/SDD
converged: YES YES NO NO
title: Mulliken charges:
elementType: O N C C C C C C C C C C H H H H H H H H H H H H H H H H H
charge: -0.266272 -0.122067 -0.136372 -0.199555 -0.443472 -0.428008 -0.441318 -0.378674 -0.405094 0.138886 -0.344584 -0.670881 0.232794 0.237847 0.204449 0.208152 0.226506 0.222136 0.234795 0.194603 0.185936 0.199041 0.215404 0.202074 0.209383 0.253698 0.234038 0.215628 0.220925
chargesum: 0.00000
title: Mulliken charges with hydrogens summed into heavy atoms:
elementType: O N C C C C C C C C C C
charge: -0.266272 -0.122067 0.096422 0.038292 -0.030871 0.020635 -0.011920 0.006304 0.012385 0.138886 0.118497 -0.000290
polarizability: 1.27402925e+02 -5.29892436e+00 1.10827893e+02 -2.29384445e+00 -1.11844874e+00 9.25036645e+01
1716.lowfreq: -12.3275 -1.2737 -0.0009 -0.0005 0.0003 16.0260 53.0706 71.3058 98.4255
frequency: 53.0417 71.2785 98.3855 136.8658 170.2767 210.2398 242.1271 302.8942 316.2149 325.4383 370.8365 414.2834 448.6820 521.6371 544.4277 561.8843 646.8069 693.7067 753.6697 778.2686 790.7783 836.9591 850.4774 879.1023 909.0904 929.6539 950.8291 984.0425 996.7842 1030.9638 1063.5009 1068.8638 1079.3152 1083.2674 1113.9942 1118.4729 1152.2583 1162.2198 1199.1419 1216.0301 1233.9915 1245.1801 1260.5035 1275.8132 1300.5313 1305.5936 1308.9559 1321.7934 1335.5662 1345.7880 1351.7917 1355.1658 1359.9854 1386.2722 1403.4833 1455.5019 1461.6143 1463.6274 1468.8951 1472.5355 1475.4506 1482.0040 1492.7562 1636.8485 2947.7848 2949.9253 2964.6285 2965.7866 2975.7918 2978.9864 2980.5607 2983.6724 3010.1740 3016.5356 3029.9615 3034.0084 3038.9092 3049.1475 3051.6995 3080.3643 3093.1273
redmass: 2.6220 3.0316 4.4793 2.6103 3.1961 1.2323 2.3451 2.0297 1.9976 2.1542 3.0383 3.2119 2.9450 3.4391 3.1002 2.6420 3.5557 4.9345 2.6624 1.8673 1.3025 1.9642 2.5005 2.4563 1.5906 2.1418 2.1248 1.7544 2.1279 2.6010 1.7757 1.7472 1.8599 1.6170 1.1736 1.7487 1.8687 1.4630 1.4672 1.7044 1.4710 1.6332 1.5121 1.5098 1.4818 1.7691 1.4242 1.4529 1.3938 1.4610 1.4740 1.3700 1.4026 1.2173 2.4323 1.0863 1.0875 1.0770 1.0863 1.0434 1.0893 1.0598 1.1034 9.8936 1.0750 1.0668 1.0607 1.0637 1.0641 1.0620 1.0653 1.0361 1.0911 1.0998 1.0959 1.0982 1.0984 1.1032 1.0976 1.0991 1.1013
irintensity: 0.2085 0.6873 3.2281 2.2079 0.1509 1.3287 4.0718 5.1302 0.8309 5.4680 3.5753 1.3310 1.8091 2.1677 0.4253 4.7649 2.5438 1.3688 0.0998 0.5153 9.4359 12.9744 4.7156 4.1383 11.6856 4.6561 3.0358 2.7844 2.1850 1.8930 0.8810 8.5974 3.5663 2.1333 0.0897 8.2347 1.3904 17.8213 5.9941 1.7554 2.5842 4.4167 65.6955 61.0376 4.7706 1.2813 20.1665 0.8307 1.2305 0.8564 1.4753 1.4452 1.1641 19.1545 54.0779 14.1680 8.8674 17.7147 13.2760 12.3380 8.7363 7.4627 15.1594 259.3636 45.4708 34.6967 40.9013 23.4097 52.6548 39.6148 29.2520 30.9472 5.1775 51.4104 49.3963 74.5930 31.5518 77.5257 0.3592 44.8354 34.2943
temp: 298.150 k
press: 1.00000 atm
elementType: 8 7 6 6 6 6 6 6 6 6 6 6 1 1 1 1 1 1 1 1 1 1 1 1 1 1 1 1 1
symmnumber: 1
zpe: 672465.3 jmol-1
zpe.correction: 0.256129 hartree
zpe.thermalcorrener: 0.267717 hartree
zpe.thermalcorrenthalpy: 0.268661 hartree
zpe.thermalcorrgfe: 0.218598 hartree
zpe.sumelectzpe: -520.311109 hartree
zpe.sumelectthermal: -520.299521 hartree
zpe.sumelectthermalent: -520.298577 hartree
zpe.sumelectthermalfe: -520.348639 hartree
dipole: 0.1613 -3.9668 1.0520
dipole: 4.1071
quadrupole: -68.0978 -81.0377 -71.7433
quadrupole: -3.4929 -1.0091 1.6908
quadrupole: 5.5284 -7.4114 1.8830 -3.4929 -1.0091 1.6908
hfenergy: -520.5672375 hartree
pointgroup: C01 [X(C10H17N1O1)]
dipole: 0.0386347 -1.5420364 0.4812493 debye
polarizability: 127.2631633|-5.6239074|110.8569811|-1.9135572|-1.9051115|92.6143378 unknown
InChI: InChI=1S/C10H17NO/c1-2-11-7-8-5-3-4-6-9(8)10(11)12/h8-9H,2-7H2,1H3
charge 0 multiplicity 1
29 atoms
O  0.767521 2.077424 -0.466054
N  1.375598 -0.181126 -0.124165
C  -0.650189 -1.045041 0.768176
C  -0.631022 0.506258 0.923663
C  -1.470853 -1.505587 -0.466287
C  0.860571 -1.376475 0.578444
C  -1.948708 1.250873 0.629078
C  -2.848412 -0.811647 -0.561119
C  -2.670382 0.722347 -0.631282
C  0.551935 0.931381 0.025293
C  2.668147 -0.139673 -0.816448
C  3.877391 -0.221377 0.142033
H  -1.051114 -1.528171 1.6785
H  -0.316746 0.752257 1.961726
H  -1.587406 -2.606776 -0.432508
H  -0.896179 -1.270684 -1.386256
H  1.375591 -1.525605 1.550843
H  1.016017 -2.284487 -0.035828
H  -1.717698 2.327082 0.516817
H  -2.624011 1.146001 1.502163
H  -3.464745 -1.073189 0.324581
H  -3.393261 -1.180126 -1.451614
H  -2.080915 0.983178 -1.533096
H  -3.652034 1.223337 -0.733755
H  2.711613 -0.966824 -1.553457
H  2.688252 0.815325 -1.372148
H  3.864031 0.621174 0.855291
H  3.880295 -1.1657 0.716923
H  4.820513 -0.172745 -0.432214
