program: Gaussian 09
title: 000092445
version: EM64L-G09RevD.01
frameworkgroup: C1[X(C8H19NO4)]
method: RPBEPBE
basis: SDD
operation: Freq
keyword: #p
keyword: freq=noraman
keyword: PBEPBE/SDD
title: #p freq=noraman PBEPBE/SDD
converged: YES YES NO NO
title: Mulliken charges:
elementType: O O O O N C C C C C C C C H H H H H H H H H H H H H H H H H H H
charge: -0.263582 -0.274580 -0.249698 -0.273690 -0.314697 -0.384118 -0.396740 -0.041755 -0.037285 -0.532115 -0.507537 -0.530390 -0.508288 0.233743 0.205930 0.208330 0.236082 0.289165 0.225532 0.200912 0.232112 0.237044 0.211468 0.209696 0.232147 0.231673 0.224701 0.220566 0.248432 0.233228 0.203228 0.230483
chargesum: 0.00000
title: Mulliken charges with hydrogens summed into heavy atoms:
elementType: O O O O N C C C C C C C C
charge: -0.263582 -0.274580 -0.249698 -0.273690 -0.025532 0.055556 0.047673 0.183778 0.163627 0.148510 0.165979 0.163309 0.158650
polarizability: 1.34582276e+02 4.50608860e+00 1.03767241e+02 2.16128905e-01 6.20705578e-02 9.21087891e+01
1716.lowfreq: -9.1745 -0.0005 -0.0003 0.0005 3.7247 16.2173 25.4363 30.4263 56.2376
frequency: 25.2309 30.3964 56.2122 83.3159 97.4374 104.7683 128.2704 133.5080 141.2920 158.0912 165.8438 179.9527 197.5095 203.2751 240.3737 272.7826 279.9107 285.3692 313.3166 372.0114 463.0153 531.9787 547.7489 592.9509 597.3753 642.1073 763.5483 786.9526 877.0407 902.4558 942.8948 949.0771 1007.2346 1022.0471 1052.5143 1068.6522 1087.9036 1105.5586 1108.6599 1112.6573 1113.9374 1118.3935 1123.8749 1147.0574 1151.5885 1156.4351 1163.8081 1182.7804 1205.2243 1229.6325 1277.1971 1300.6218 1338.3683 1349.8689 1359.4407 1391.6151 1417.8406 1419.1797 1428.6001 1431.3262 1451.3867 1455.4763 1456.9787 1458.8913 1460.4069 1473.8361 1478.4147 1480.9333 1483.1187 1492.7481 1502.6024 2873.3744 2884.2929 2949.9762 2956.1226 2959.5929 2962.9910 2968.2204 3006.9014 3007.3287 3023.3383 3045.2744 3047.9533 3052.6794 3064.0697 3111.3443 3111.5972 3112.6452 3115.6587 3464.6428
redmass: 3.6383 3.6951 4.1518 2.9166 2.2937 2.2611 1.3409 1.3101 1.1300 2.5847 2.3567 1.8669 2.0553 1.8266 4.7181 2.4304 3.3767 2.5211 3.8508 4.9017 4.4833 3.8369 2.9773 2.0166 3.2947 1.6257 3.4971 3.5088 6.0467 5.2684 3.2881 3.1642 7.6964 6.0428 2.4128 2.5373 3.6603 1.9094 1.7356 1.2653 1.3558 1.3428 1.5441 1.3934 1.4093 1.4612 1.6032 3.6639 1.3819 1.2500 1.2242 1.2631 1.2567 1.1951 1.2171 1.5666 1.1384 1.1279 1.1489 1.1558 1.2373 1.0530 1.0526 1.0553 1.0647 1.0548 1.0549 1.0631 1.0548 1.0704 1.0678 1.0712 1.0713 1.0371 1.0342 1.0347 1.0746 1.0384 1.0844 1.0881 1.0891 1.0981 1.1004 1.0998 1.1045 1.1015 1.1014 1.1010 1.1010 1.0748
irintensity: 0.3363 0.2832 0.7167 0.4529 1.8162 6.7577 7.2362 0.7736 0.6804 6.8928 3.6558 6.8224 5.2746 20.3491 1.5446 6.1229 0.6204 6.6295 26.8189 0.7127 8.8743 4.2153 32.7014 34.3174 11.9806 28.3741 34.9161 29.7276 73.3309 31.9608 44.0336 38.2776 253.7847 25.5390 48.3666 19.1761 179.2543 15.1671 36.6847 0.3326 11.0478 11.8936 12.9205 5.1812 10.8251 2.2525 3.6494 59.8201 18.3057 11.4122 5.6424 1.9180 26.6896 7.4431 6.9823 3.5206 12.9583 0.5807 9.2416 5.5852 36.5976 8.5891 9.5852 5.5026 3.8342 9.5923 12.9043 25.1452 5.2809 12.6853 2.2072 74.7228 98.9918 66.8575 77.1705 39.9652 94.0886 12.8350 26.1993 66.1687 40.5942 47.5393 38.7513 58.5956 31.7577 15.9891 32.4675 26.4878 25.1827 5.7866
temp: 298.150 k
press: 1.00000 atm
elementType: 8 8 8 8 7 6 6 6 6 6 6 6 6 1 1 1 1 1 1 1 1 1 1 1 1 1 1 1 1 1 1 1
symmnumber: 1
zpe: 716867.1 jmol-1
zpe.correction: 0.273040 hartree
zpe.thermalcorrener: 0.290300 hartree
zpe.thermalcorrenthalpy: 0.291244 hartree
zpe.thermalcorrgfe: 0.226684 hartree
zpe.sumelectzpe: -670.709044 hartree
zpe.sumelectthermal: -670.691784 hartree
zpe.sumelectthermalent: -670.690840 hartree
zpe.sumelectthermalfe: -670.755400 hartree
dipole: 0.7300 -0.7578 -0.1360
dipole: 1.0610
quadrupole: -67.9500 -71.6127 -88.3249
quadrupole: 1.6799 0.4172 -1.2684
quadrupole: 8.0125 4.3499 -12.3624 1.6799 0.4172 -1.2684
hfenergy: -670.9820843 hartree
pointgroup: C01 [X(C8H19N1O4)]
dipole: -0.2903952 -0.2934197 0.0617164 debye
polarizability: 134.4775383|-4.8488002|103.8628119|0.2195456|-0.3472677|92.1179553 unknown
InChI: InChI=1S/C8H19NO4/c1-10-7(11-2)5-9-6-8(12-3)13-4/h7-9H,5-6H2,1-4H3
charge 0 multiplicity 1
32 atoms
O  -2.506895 -0.582199 -1.087808
O  -3.582025 0.418003 0.841565
O  2.603138 0.530485 -1.132355
O  3.608569 -0.455588 0.838549
N  0.031325 0.150119 0.1333
C  -1.20544 0.146458 0.926015
C  1.25137 -0.169605 0.888196
C  -2.401541 0.403001 0.001115
C  2.448102 -0.42256 -0.04703
C  -2.71508 -1.970424 -0.637792
C  -4.777208 0.92768 0.152002
C  2.583037 1.945105 -0.71647
C  4.824361 -0.945435 0.174381
H  -1.170586 0.959815 1.675148
H  -1.377139 -0.802367 1.493149
H  1.148489 -1.076446 1.532901
H  1.503372 0.669722 1.565519
H  -0.065204 -0.362239 -0.75267
H  -2.278607 1.354176 -0.554369
H  2.350479 -1.38732 -0.590927
H  -2.986892 -2.531946 -1.545061
H  -3.531682 -2.027889 0.105314
H  -1.792388 -2.403521 -0.20263
H  -4.634605 1.984297 -0.153592
H  -5.597831 0.861118 0.882698
H  -5.012591 0.32068 -0.742147
H  2.839203 2.516298 -1.62233
H  3.332557 2.13666 0.074741
H  1.570883 2.22289 -0.368715
H  5.0790 -0.321291 -0.70227
H  4.700448 -1.998705 -0.153368
H  5.624779 -0.885375 0.928041
