program: Gaussian 09
title: 000092471
version: EM64L-G09RevD.01
frameworkgroup: C1[X(C10H6O5S)]
method: RPBEPBE
basis: SDD
operation: Freq
keyword: #p
keyword: freq=noraman
keyword: PBEPBE/SDD
title: #p freq=noraman PBEPBE/SDD
converged: NO YES NO NO
title: Mulliken charges:
elementType: S O O O O O C C C C C C C C C C H H H H H H
charge: 1.021942 -0.215226 -0.533425 -0.165005 -0.479137 -0.490179 0.299575 0.250151 -0.226082 0.153184 0.016837 -0.331602 -0.341756 -0.343190 -0.216511 -0.211896 0.324046 0.292019 0.291584 0.252092 0.251382 0.401198
chargesum: 0.00000
title: Mulliken charges with hydrogens summed into heavy atoms:
elementType: S O O O O O C C C C C C C C C C
charge: 1.021942 -0.215226 -0.132228 -0.165005 -0.479137 -0.490179 0.299575 0.250151 -0.226082 0.153184 0.016837 -0.007556 -0.049737 -0.051606 0.035582 0.039486
polarizability: 2.16264276e+02 -4.41570394e+00 1.71799778e+02 -1.14538669e+00 -1.93617655e+00 7.51823939e+01
1716.lowfreq: -7.8651 -0.0015 -0.0009 0.0019 3.2078 8.0961 43.8610 54.9007 112.9361
frequency: 43.8565 54.8941 112.9336 124.9242 128.7509 173.8804 186.5271 206.9700 216.9032 270.6904 279.1420 312.6155 360.9350 374.9072 401.8076 424.8098 442.0821 451.9985 476.7341 482.2057 553.0133 582.3051 634.6021 668.1199 694.9976 708.3172 763.2497 792.8801 795.7452 825.2766 846.8644 923.4335 945.1936 966.2412 1000.3674 1013.6682 1019.3220 1042.1290 1069.2770 1106.1754 1144.1437 1178.0613 1214.9044 1251.5974 1286.9550 1306.3094 1400.8599 1439.8369 1469.4583 1529.9695 1551.9564 1580.3741 1605.2132 1617.2385 3146.1265 3146.4272 3157.2470 3166.6248 3178.0954 3350.3082
redmass: 9.7443 10.0623 9.5307 7.1073 4.9954 7.5934 9.5604 6.4780 7.3519 6.9669 9.2081 11.0788 7.8359 5.7872 7.2204 3.6989 3.3787 2.2487 7.3363 3.1626 9.9174 7.3666 6.0399 3.6122 6.5080 3.8792 8.8960 4.6113 1.4711 3.7066 14.4479 1.3890 1.6982 7.7314 1.4015 4.1616 1.3789 3.4077 2.6667 1.8362 1.2279 1.0746 1.8570 2.1034 2.3892 2.4871 9.7088 2.4201 2.6837 10.1118 8.5966 7.6970 6.7873 9.1616 1.0878 1.0926 1.0903 1.0951 1.1008 1.0652
irintensity: 0.4868 1.7731 6.9080 10.0771 2.9496 1.0796 0.9560 3.5552 3.3731 4.9423 4.4402 8.2388 22.7442 13.4309 31.4109 7.6539 44.7527 128.4556 13.0905 53.2559 102.5125 41.1661 3.1826 5.9236 2.7836 41.5211 11.5564 4.9719 63.4278 3.8317 92.8182 4.8748 10.8598 62.2273 1.9385 18.8439 0.0597 7.3721 19.0756 22.9254 163.9431 4.2673 36.8039 113.0343 150.7008 62.2728 0.4138 0.3777 0.1464 59.2851 199.4107 27.0677 2.7731 60.3060 2.5310 9.5221 1.0698 0.5201 18.8338 72.3512
temp: 298.150 k
press: 1.00000 atm
elementType: 16 8 8 8 8 8 6 6 6 6 6 6 6 6 6 6 1 1 1 1 1 1
symmnumber: 1
zpe: 366060.0 jmol-1
zpe.correction: 0.139425 hartree
zpe.thermalcorrener: 0.153570 hartree
zpe.thermalcorrenthalpy: 0.154514 hartree
zpe.thermalcorrgfe: 0.098110 hartree
zpe.sumelectzpe: -1157.518664 hartree
zpe.sumelectthermal: -1157.504519 hartree
zpe.sumelectthermalent: -1157.503575 hartree
zpe.sumelectthermalfe: -1157.559979 hartree
dipole: -8.6446 -1.9785 -0.3234
dipole: 8.8741
quadrupole: -100.5167 -102.8642 -105.4050
quadrupole: 5.9722 -1.2728 2.6824
quadrupole: 2.4119 0.0644 -2.4764 5.9722 -1.2728 2.6824
hfenergy: -1157.658089 hartree
pointgroup: C01 [X(C10H6O5S1)]
dipole: -3.4034328 -0.7735031 -0.087533 debye
dipolederiv: 1.8277315 -0.0535832 0.0318795 0.168746 1.1822624 0.0891883 0.0548154 0.0972296 1.4226744 -0.7885406 0.0964847 0.0468922 0.3678929 -0.6650295 -0.0821742 0.1286484 -0.0516752 -0.2820472 -0.7089397 0.0986224 -0.1061969 0.1799936 -0.6405468 -0.3415975 0.0810611 -0.2406152 -0.639298 -0.6183165 0.1609171 0.0140556 -0.0198046 -0.9005226 -0.0256126 0.0029385 -0.0359293 -0.298273 -0.7093516 0.0381221 -0.0005538 0.0357067 -0.4342561 0.1017177 -0.1224646 0.0419795 -0.5882951 -0.6998841 -0.036839 -0.0031746 -0.1932597 -0.486462 0.0376411 0.0260704 0.0711224 -0.4320509 -0.7844126 0.0499545 0.0427015 -0.0396586 0.0432203 -0.0035391 0.0194892 -0.0131019 -0.0032766 -0.2746232 -0.2819308 -0.0117276 -0.4459582 -0.3543587 -0.002636 -0.0379533 -0.0085109 0.0108422 0.217371 -0.2130554 -0.0079693 -0.5569561 -0.3976061 -0.015913 -0.0840669 0.01975 -0.1941131 1.1393169 0.1371311 -0.0498424 0.1168209 0.8348902 0.099819 -0.0404024 0.0622036 0.2126751 1.4509175 -0.0298857 -0.0332156 0.349135 1.0406339 0.02247 0.0018529 0.0397277 0.2089184 -0.8201076 0.1964877 0.0202237 0.1608669 0.0751644 0.0143526 0.0469578 -0.0199176 0.0095007 -0.1303391 -0.270197 -0.0158369 0.0839895 0.045902 0.0038831 0.0220945 0.0218336 -0.0755409 -0.1920544 0.0283911 0.0085682 -0.2503865 0.0908367 0.0222513 -0.0071564 0.011086 -0.0831227 0.1033621 0.2512733 0.0052686 0.0883815 0.0329559 0.0044564 -0.003041 -0.0014585 -0.1239385 0.2611307 -0.0344822 -0.0211279 0.109604 -0.0475166 -0.0018861 -0.0123808 0.0050215 -0.1168888 0.0961679 -0.0200461 0.000134 -0.0119569 0.1273671 -0.0036795 -0.0210096 0.0029515 0.141813 0.0992362 0.0719237 0.0064043 0.0131326 0.0411015 -0.007672 -0.0012251 -0.0136813 0.1521551 0.1173582 -0.0091517 0.0022855 0.0613679 0.0215022 -0.0113613 0.0068669 -0.0067312 0.154592 0.0122702 -0.0801586 0.0016485 -0.0931775 -0.0032709 -0.0060117 0.0004004 -0.0062226 0.1574091 -0.0828207 0.0131105 0.0122321 0.0202542 0.0972311 -0.0047334 0.011667 -0.0046766 0.1567804 0.4845282 -0.1130886 0.0573515 -0.1447339 0.2965018 0.1110368 -0.0731626 0.029615 0.2094844 unknown
polarizability: 216.0741115|-4.0527898|171.499702|-5.6175532|5.6758389|75.6726341 unknown
InChI: InChI=1S/C10H6O5S/c11-8-5-9(16(13,14)15)10(12)7-4-2-1-3-6(7)8/h1-5,13H
charge 0 multiplicity 1
22 atoms
S  3.11976 0.069634 -0.014952
O  0.885905 -2.015965 -0.369523
O  3.323542 -1.001241 -1.492192
O  -1.14769 3.066299 0.129355
O  3.474917 -0.7468 1.331293
O  3.826579 1.471085 -0.365883
C  -1.092767 -0.635696 -0.079634
C  -1.621968 0.686176 0.03378
C  1.224775 0.350493 -0.071731
C  0.374908 -0.866191 -0.175205
C  -0.718498 1.875803 0.058204
C  0.756787 1.620723 0.009076
C  -1.968269 -1.748057 -0.114718
C  -3.021979 0.874712 0.109736
C  -3.362528 -1.549467 -0.032127
C  -3.889047 -0.238705 0.079876
H  1.423469 2.491345 0.040639
H  -1.539139 -2.750834 -0.204405
H  -3.40773 1.896099 0.189835
H  -4.038455 -2.410128 -0.055342
H  -4.971692 -0.08889 0.141626
H  2.78642 -1.827896 -1.272706
