program: Gaussian 09
title: 000092454
version: EM64L-G09RevD.01
frameworkgroup: C1[X(C15H18)]
method: RPBEPBE
basis: SDD
operation: Freq
keyword: #p
keyword: freq=noraman
keyword: PBEPBE/SDD
title: #p freq=noraman PBEPBE/SDD
converged: YES YES NO NO
title: Mulliken charges:
elementType: C C C C C C C C C C C C C C C H H H H H H H H H H H H H H H H H H
charge: -0.219387 0.563769 -0.368367 -0.607640 -0.716625 0.381018 0.376741 -0.479638 -0.432323 -0.693845 -0.615662 -0.439778 0.453354 -0.369934 -0.813575 0.199610 0.196805 0.197364 0.237407 0.227410 0.210566 0.211401 0.231771 0.234051 0.212385 0.203679 0.234022 0.239726 0.235442 0.228191 0.224514 0.228888 0.228659
chargesum: 0.00000
title: Mulliken charges with hydrogens summed into heavy atoms:
elementType: C C C C C C C C C C C C C C C
charge: -0.019777 0.563769 0.025801 -0.370233 -0.067247 0.381018 0.376741 -0.247867 -0.198272 -0.043759 -0.375936 -0.204336 0.453354 -0.141743 -0.131514
polarizability: 2.50168359e+02 9.33310293e+00 1.55670261e+02 -1.03070470e+01 -3.64150978e+00 9.96694827e+01
1716.lowfreq: -11.3882 -7.3146 -5.7721 -0.0003 0.0002 0.0005 18.8189 47.1015 89.4472
frequency: 18.0755 47.0382 89.4373 99.9807 140.7990 144.5224 183.5921 199.3896 217.1117 237.7904 247.9075 279.6444 351.6365 388.0456 403.7608 409.4301 444.8502 481.3683 494.1226 520.4627 568.1054 581.9412 657.9727 677.3537 735.4239 778.6037 790.0585 810.1651 815.8062 833.8908 850.4500 898.6213 910.3984 914.3519 953.6707 961.8749 968.7306 975.4287 999.3880 1004.9591 1027.6018 1049.6269 1083.3874 1097.9655 1131.0028 1141.2201 1162.1944 1186.0575 1191.7280 1238.5706 1250.1987 1262.6506 1276.8326 1288.6149 1322.6438 1332.3134 1359.5497 1385.7582 1388.9587 1396.9268 1405.3178 1412.4181 1426.4548 1464.1583 1468.9549 1471.5662 1473.6100 1475.9050 1476.5031 1484.1509 1486.9364 1511.5140 1577.9211 1613.4380 1644.5876 2965.7684 2972.1806 2972.6883 2974.0310 2976.2702 3022.0072 3049.0821 3066.9183 3069.4013 3077.7804 3078.8724 3083.1945 3109.2572 3111.2889 3111.9802 3115.1729 3136.1009 3137.3697
redmass: 3.2823 3.3533 1.8147 1.2819 2.3166 2.6128 3.5807 2.4012 1.0771 1.3564 3.0440 2.7739 3.3776 3.0793 3.1510 3.8105 3.1786 2.5499 3.2998 6.6190 2.8789 3.3243 5.3381 2.9474 4.4071 1.5566 2.4244 1.6656 1.7509 1.3538 2.2407 1.4575 3.1171 1.7398 2.3697 1.4363 1.3834 1.3839 1.6592 1.5361 2.5971 1.5580 1.6158 2.5348 2.0275 1.5693 1.4881 1.4833 1.4758 1.7331 1.6773 1.7346 1.7912 1.2584 1.6076 1.5769 1.6288 1.2029 1.2192 1.2585 2.8950 3.1772 7.6201 1.0677 1.0479 1.1967 1.0616 1.0783 1.1194 1.1269 1.9583 3.1123 6.8361 5.7701 6.7062 1.0743 1.0588 1.0377 1.0379 1.0423 1.1008 1.0974 1.0998 1.0993 1.1000 1.0998 1.0985 1.0901 1.0867 1.0867 1.0912 1.0975 1.0972
irintensity: 0.0302 0.4992 0.9025 0.0121 0.2502 0.1265 1.0695 0.3800 0.0174 0.1100 0.6197 0.7975 1.4059 0.6127 1.0067 0.2642 1.7122 18.1189 0.2851 0.0574 0.0902 1.6579 0.2995 11.2269 2.0417 9.5702 2.0559 0.8547 7.8338 37.7496 0.2320 43.8679 5.7395 2.7384 1.8290 5.9654 0.3866 4.0575 12.3737 11.9688 2.6010 12.8764 5.8110 2.8995 0.5743 8.1018 0.3075 6.7463 1.4076 2.9397 3.9666 0.2981 4.8227 1.9737 0.2142 4.9165 5.6355 2.7448 23.9860 9.7186 2.9626 1.3799 0.2393 2.4410 13.0013 11.3367 9.0747 7.0716 13.2290 8.9452 1.4212 19.9110 0.0893 29.1528 1.2132 12.0379 19.8084 52.4731 77.5317 21.3545 30.8703 22.5543 22.8909 74.0166 20.7520 88.7300 18.7633 12.2808 8.4934 10.3700 24.1575 56.4172 3.2802
temp: 298.150 k
press: 1.00000 atm
elementType: 6 6 6 6 6 6 6 6 6 6 6 6 6 6 6 1 1 1 1 1 1 1 1 1 1 1 1 1 1 1 1 1 1
symmnumber: 1
zpe: 742179.7 jmol-1
zpe.correction: 0.282681 hartree
zpe.thermalcorrener: 0.297373 hartree
zpe.thermalcorrenthalpy: 0.298317 hartree
zpe.thermalcorrgfe: 0.240346 hartree
zpe.sumelectzpe: -581.322735 hartree
zpe.sumelectthermal: -581.308043 hartree
zpe.sumelectthermalent: -581.307099 hartree
zpe.sumelectthermalfe: -581.365070 hartree
dipole: -0.0456 -0.0943 0.0249
dipole: 0.1077
quadrupole: -79.3173 -83.5713 -96.2348
quadrupole: 0.2291 -1.4136 -1.1763
quadrupole: 7.0571 2.8032 -9.8603 0.2291 -1.4136 -1.1763
hfenergy: -581.6054159 hartree
pointgroup: C01 [X(C15H18)]
dipole: 0.0183755 0.037511 0.0071196 debye
polarizability: 250.4334097|9.0181265|155.6998707|9.1351039|-0.4460096|99.3748225 unknown
InChI: InChI=1S/C15H18/c1-4-12(3)13-7-8-14-9-11(2)5-6-15(14)10-13/h5-10,12H,4H2,1-3H3
charge 0 multiplicity 1
33 atoms
C  -3.164051 -0.073271 -0.442762
C  -1.655458 -0.299226 -0.302709
C  -3.763855 0.712367 0.760997
C  -0.755437 0.773942 -0.231753
C  -3.505446 0.63489 -1.781926
C  0.656213 0.567551 -0.113054
C  1.175284 -0.783818 -0.065374
C  -1.126629 -1.632605 -0.252668
C  0.245446 -1.870917 -0.138325
C  -3.620173 -0.017216 2.113344
C  2.591101 -0.98887 0.051564
C  1.588322 1.656959 -0.039507
C  3.48638 0.083906 0.121413
C  2.95774 1.421976 0.07413
C  4.984324 -0.129822 0.244586
H  -3.651343 -1.070659 -0.456262
H  -4.836689 0.900047 0.552101
H  -3.279395 1.70795 0.821027
H  -1.127128 1.806411 -0.267233
H  -3.106318 0.072463 -2.645055
H  -4.600665 0.730475 -1.90514
H  -3.07122 1.651686 -1.813872
H  -1.824169 -2.47782 -0.305964
H  0.625401 -2.899327 -0.102409
H  -4.06302 0.574697 2.935434
H  -4.131611 -0.998484 2.090328
H  -2.557654 -0.197412 2.357198
H  2.97082 -2.018312 0.085543
H  1.206314 2.684746 -0.074345
H  3.655002 2.267405 0.128959
H  5.24041 -1.202836 0.2735
H  5.525716 0.324171 -0.607376
H  5.381889 0.338054 1.165509
