program: Gaussian 09
title: 000092670
version: EM64L-G09RevD.01
frameworkgroup: C1[X(C20H18ClN5O6)]
method: RPBEPBE
basis: SDD
operation: Freq
keyword: #p
keyword: freq=noraman
keyword: PBEPBE/SDD
title: #p freq=noraman PBEPBE/SDD
converged: YES YES NO NO
title: Mulliken charges:
elementType: Cl O O O O O O N N N N N C C C C C C C C C C C C C C C C C C C C H H H H H H H H H H H H H H H H H H
charge: -0.000406 -0.305679 -0.454634 -0.199815 -0.183625 -0.208326 -0.210344 -0.389318 -0.078841 -0.079804 0.010890 0.014677 0.259836 0.299988 0.267074 -0.369156 -0.056424 -0.376462 -0.367641 -0.308950 -0.366601 -0.275782 -0.261919 -0.239697 -0.205777 0.183088 0.414828 -0.311070 -0.237518 -0.518549 0.453644 -0.419250 0.343823 0.220888 0.249792 0.238736 0.203319 0.283619 0.297737 0.205497 0.215018 0.232084 0.242699 0.219851 0.189136 0.192850 0.203390 0.316191 0.313756 0.353176
chargesum: 0.00000
title: Mulliken charges with hydrogens summed into heavy atoms:
elementType: Cl O O O O O O N N N N N C C C C C C C C C C C C C C C C C C C C
charge: -0.000406 -0.305679 -0.101458 -0.199815 -0.183625 -0.208326 -0.210344 -0.045495 -0.078841 -0.079804 0.010890 0.014677 0.259836 0.299988 0.267074 0.101524 -0.056424 -0.137726 -0.164322 -0.025330 -0.068863 0.144733 -0.029835 0.003002 0.203211 0.183088 0.414828 0.085170 -0.237518 -0.202358 0.453644 -0.105494
polarizability: 8.51549998e+02 -6.13383754e-01 3.32495974e+02 2.15827210e+01 -8.81140527e+00 1.54346706e+02
1716.lowfreq: -4.5716 -3.0700 0.0007 0.0011 0.0016 1.9400 7.5185 13.8559 20.1936
frequency: 7.1839 13.8242 20.1522 23.9147 28.1128 45.3228 53.1104 59.3933 63.5318 82.5715 84.9230 96.2577 101.3592 118.8914 131.5078 144.0910 152.9967 167.8307 173.7705 187.0473 189.9298 192.6180 200.9849 217.6204 263.7693 281.3724 295.4302 309.9291 311.1038 332.9264 344.1192 370.3523 376.4905 393.7834 415.0769 427.0348 452.8256 473.2074 482.8510 484.8923 515.6856 515.8734 530.0868 556.7764 578.8778 590.6585 604.9785 623.2547 651.7584 667.3970 676.0874 683.4411 699.9685 702.4602 729.8604 757.1877 764.0822 769.1134 786.2882 795.4100 800.3875 815.9216 835.3939 853.9819 865.7394 880.3468 902.8827 906.8824 920.1070 931.7951 936.9940 964.7939 986.6167 1012.7107 1013.7498 1029.6258 1042.2987 1047.3762 1050.1489 1058.8763 1063.7797 1075.2871 1094.3483 1129.3363 1140.8733 1158.8593 1178.9741 1181.3980 1188.1764 1190.0672 1199.3068 1201.3359 1213.1540 1225.9862 1229.1230 1245.5235 1258.9361 1264.0088 1292.8019 1315.6319 1324.7622 1342.9568 1348.1039 1356.9525 1366.0193 1366.2072 1375.7445 1390.9416 1403.8725 1412.4747 1418.3208 1422.3446 1423.7675 1441.7049 1453.7311 1461.2866 1463.9792 1470.8897 1479.9686 1508.5281 1542.1734 1549.5557 1553.2154 1586.2069 1598.7226 1621.9181 2938.5982 2942.4721 2955.3866 2972.4933 3003.3722 3008.8070 3018.0572 3050.1722 3121.4150 3143.3710 3153.2615 3160.9362 3172.2338 3176.5090 3184.0774 3193.3267 3505.3273 3584.8565
redmass: 6.9715 6.2792 6.3571 8.8745 5.4498 4.3312 7.5387 11.4313 8.4137 4.2153 6.7832 5.4987 7.8043 3.9067 8.0588 10.6402 7.4887 3.2125 3.9511 5.3601 5.3132 4.7719 1.4027 2.7558 3.8706 5.6689 8.1395 4.0724 8.5988 5.3427 5.6708 5.7453 6.3494 8.9557 4.2693 4.2939 5.2005 7.0468 2.6202 3.7480 7.4997 3.7640 4.9273 6.7160 5.7817 2.1341 7.3377 5.8925 8.0399 3.9884 1.4483 9.1076 7.2732 9.2748 4.9912 4.9596 2.6394 2.0212 2.6977 3.4970 3.8663 10.6821 1.6136 5.8263 2.6780 1.5445 3.7302 3.4417 1.3786 1.4918 2.6505 1.3741 1.3647 3.3758 1.3641 2.5561 3.0148 3.3013 2.1373 1.8919 2.0450 4.0279 1.8658 6.4762 2.2472 1.7681 1.3118 1.6757 1.2142 1.2259 3.4841 5.1965 1.2296 8.3181 1.1246 1.2214 1.6679 1.1325 2.8766 3.9970 2.0077 1.2564 5.2715 1.9442 2.8262 7.5172 8.3390 1.3665 2.1006 6.1526 1.5995 5.5854 4.4249 2.2077 1.1013 1.0813 1.8459 1.3124 1.1051 3.2897 4.4649 7.6043 4.1795 7.8375 6.9888 6.0596 1.0579 1.0580 1.0584 1.0653 1.1053 1.1010 1.1038 1.0990 1.0864 1.0899 1.0871 1.0949 1.0962 1.0986 1.0929 1.0930 1.0756 1.0667
irintensity: 0.0841 0.5825 0.3558 0.0828 1.2140 1.0022 0.7676 1.6574 5.1055 4.2827 1.7547 2.5479 0.9654 0.8949 4.7925 3.4752 3.9815 14.6774 30.2779 38.0705 11.5754 1.9957 146.8239 7.7430 1.7967 3.4341 7.8644 3.3301 0.7143 2.1912 4.0940 1.3977 14.0187 0.6184 10.3615 9.7857 4.8903 14.9246 25.4892 3.1777 2.9556 4.0806 2.2016 7.5624 15.1023 36.9770 5.0813 15.7363 5.4294 3.7461 103.7084 29.9310 14.2434 9.3829 10.8370 23.6954 43.0490 65.1148 27.2604 1.9928 26.5703 27.7820 32.6452 12.6244 36.3965 1.0636 52.0733 6.7654 9.6707 29.4499 21.1288 1.1599 0.4254 56.5402 0.7650 4.9746 95.1891 26.6534 4.8377 10.2106 84.0545 284.6359 6.7186 7.4532 15.6825 13.6378 507.2756 58.1793 276.0572 33.7985 596.5993 1161.5255 3.2055 284.8401 25.1589 67.8786 1.2294 19.2764 330.4860 842.7689 158.4728 52.3552 56.0679 49.6349 61.9874 113.6695 174.4092 2.2349 40.1229 20.0268 6.0400 8.4353 26.6938 10.3530 17.0610 13.0517 44.1867 49.5509 5.0004 85.4810 39.9800 263.2063 204.5287 502.1910 527.1580 13.9855 7.2676 68.3922 116.1506 32.4034 62.2915 112.8540 55.3687 22.6847 6.6990 12.2856 8.3235 20.3538 19.3869 16.0303 10.7142 11.8759 466.9391 6.9349
temp: 298.150 k
press: 1.00000 atm
elementType: 17 8 8 8 8 8 8 7 7 7 7 7 6 6 6 6 6 6 6 6 6 6 6 6 6 6 6 6 6 6 6 6 1 1 1 1 1 1 1 1 1 1 1 1 1 1 1 1 1 1
symmnumber: 1
zpe: 947705.1 jmol-1
zpe.correction: 0.360962 hartree
zpe.thermalcorrener: 0.390959 hartree
zpe.thermalcorrenthalpy: 0.391903 hartree
zpe.thermalcorrgfe: 0.294064 hartree
zpe.sumelectzpe: -1955.556253 hartree
zpe.sumelectthermal: -1955.526255 hartree
zpe.sumelectthermalent: -1955.525311 hartree
zpe.sumelectthermalfe: -1955.623150 hartree
dipole: -16.8926 -2.0542 -2.2063
dipole: 17.1595
quadrupole: -188.6931 -181.9656 -195.3821
quadrupole: -13.2289 8.4580 -1.5679
quadrupole: -0.0128 6.7147 -6.7019 -13.2289 8.4580 -1.5679
hfenergy: -1955.9172146 hartree
pointgroup: C01 [X(C20H18Cl1N5O6)]
dipole: 6.6848957 -0.5473767 0.7676322 debye
polarizability: 852.0227949|9.158316|328.69061|-4.5066132|-27.8393361|157.6792728 unknown
InChI: InChI=1S/C20H18ClN5O6/c21-16-11-13(25(28)29)12-19(26(30)31)20(16)24-23-18-6-5-17(22-7-9-32-10-8-27)14-3-1-2-4-15(14)18/h1-6,11-12,22,27H,7-10H2
charge 0 multiplicity 1
50 atoms
Cl -3.758548 -3.336975 1.341963
O  7.031147 -0.766591 -0.158939
O  9.281937 -0.186938 -2.076018
O  -3.007741 2.627367 -0.435457
O  -2.401068 1.09797 -2.024507
O  -7.990432 1.160997 -0.32965
O  -8.40312 -0.908374 0.552143
N  4.370729 -0.833191 0.227448
N  -1.20798 -0.058858 0.327914
N  -2.002157 -1.123021 0.331701
N  -3.008898 1.438781 -0.940067
N  -7.601908 0.01194 0.121152
C  2.4586 0.703069 0.321909
C  3.01209 -0.648874 0.242304
C  1.02735 0.875979 0.342477
C  5.068645 -2.120893 0.124869
C  0.159369 -0.294478 0.2950
C  2.124009 -1.767126 0.18473
C  3.293205 1.864365 0.378541
C  0.738458 -1.591656 0.211895
C  0.484693 2.197129 0.399088
C  6.52161 -1.9277 0.578205
C  2.740268 3.148131 0.439742
C  1.325077 3.314149 0.446069
C  8.431344 -0.446119 0.158575
C  -3.358486 -0.802183 0.224814
C  -3.890141 0.427321 -0.302284
C  8.938501 0.561807 -0.86186
C  -4.329278 -1.75919 0.663585
C  -5.25887 0.716879 -0.320457
C  -6.155391 -0.265648 0.147323
C  -5.704798 -1.51515 0.633224
H  5.000284 -0.032766 0.117895
H  4.588567 -2.878127 0.771049
H  5.048271 -2.494094 -0.919262
H  2.530623 -2.778441 0.100724
H  4.385536 1.773759 0.381942
H  0.063867 -2.452303 0.168054
H  -0.602202 2.315914 0.39708
H  6.569323 -1.737858 1.673061
H  7.116457 -2.834046 0.342981
H  3.394666 4.025201 0.481689
H  0.892989 4.319396 0.484597
H  9.057016 -1.36058 0.102491
H  8.494378 -0.027388 1.18648
H  9.833466 1.07385 -0.447466
H  8.148397 1.319108 -1.048067
H  -5.63888 1.667598 -0.703175
H  -6.429046 -2.252298 0.986743
H  9.39357 0.433658 -2.838146
