program: Gaussian 09
title: 000092438
version: EM64L-G09RevD.01
frameworkgroup: C1[X(C8H4N2O4S2)]
method: RPBEPBE
basis: SDD
operation: Freq
keyword: #p
keyword: freq=noraman
keyword: PBEPBE/SDD
title: #p freq=noraman PBEPBE/SDD
converged: NO YES NO NO
title: Mulliken charges:
elementType: S S O O O O N N C C C C C C C C H H H H
charge: 0.425352 0.319700 -0.389838 -0.204920 -0.207779 -0.237406 0.022062 0.079907 -0.058560 -0.178892 -0.267850 -0.090928 -0.223799 0.232899 -0.608553 0.118965 0.266960 0.299808 0.311842 0.391028
chargesum: 0.00000
title: Mulliken charges with hydrogens summed into heavy atoms:
elementType: S S O O O O N N C C C C C C C C
charge: 0.425352 0.319700 0.001190 -0.204920 -0.207779 -0.237406 0.022062 0.079907 -0.058560 -0.178892 -0.000890 -0.090928 0.076009 0.232899 -0.296711 0.118965
polarizability: 3.12617567e+02 9.99031163e+00 1.69197497e+02 -9.88795220e-03 3.90840247e-03 5.31131247e+01
1716.lowfreq: -11.7498 -5.2265 -1.8102 -0.0021 -0.0002 0.0026 31.4121 44.7559 55.6456
frequency: 31.3322 44.7052 55.6450 64.8580 88.4742 139.2377 149.9507 200.6292 200.8808 224.7062 293.2346 320.3762 366.7722 412.1339 443.5019 468.2595 514.5956 517.8358 560.8876 586.9335 606.8857 624.5273 648.7762 661.3013 675.8336 692.9291 731.9973 734.8622 780.8250 820.5005 829.3062 836.3862 906.0472 935.4549 1020.4988 1039.2083 1097.0686 1115.4370 1186.5322 1216.8163 1237.2730 1264.6194 1324.3040 1350.0099 1358.0483 1460.5787 1478.0805 1494.9874 1568.4164 1633.9534 3176.6972 3214.1983 3250.5373 3520.1375
redmass: 8.1293 14.6444 11.4367 11.1667 10.6374 10.9750 10.6632 9.6523 6.8358 15.0816 6.6328 12.9902 11.5015 11.2508 6.2005 11.3077 3.3717 9.1151 2.7096 8.7784 2.6285 5.7999 2.5922 10.2122 9.7585 6.2738 12.0626 4.1088 6.9537 1.3334 1.5105 6.0340 9.7881 1.4075 2.2115 2.3550 2.7135 1.5351 4.3664 1.9849 3.7118 2.6227 4.0681 8.2343 6.4615 7.8662 8.2206 6.9669 8.4124 9.2602 1.0938 1.0986 1.0959 1.0642
irintensity: 0.8862 1.3338 0.9751 0.2285 0.6945 5.6110 0.6717 3.7651 1.0305 3.2401 0.2430 3.1976 2.2873 10.3603 1.3397 0.1050 18.8739 2.2347 26.9755 28.5922 20.9420 51.7810 88.5879 12.0370 24.4617 2.3984 13.9977 32.4620 1.6682 34.2560 59.0114 65.2738 50.0124 2.0233 4.9263 124.1275 16.8296 157.6330 205.5585 1.1892 455.4772 20.7203 87.9066 17.9395 93.9262 50.0439 57.2931 67.6867 6.7619 319.6094 1.9925 3.1264 21.2038 54.9225
temp: 298.150 k
press: 1.00000 atm
elementType: 16 16 8 8 8 8 7 7 6 6 6 6 6 6 6 6 1 1 1 1
symmnumber: 1
zpe: 300131.0 jmol-1
zpe.correction: 0.114314 hartree
zpe.thermalcorrener: 0.128584 hartree
zpe.thermalcorrenthalpy: 0.129528 hartree
zpe.thermalcorrgfe: 0.070587 hartree
zpe.sumelectzpe: -1512.534237 hartree
zpe.sumelectthermal: -1512.519967 hartree
zpe.sumelectthermalent: -1512.519023 hartree
zpe.sumelectthermalfe: -1512.577965 hartree
dipole: 3.6524 4.0608 -0.0023
dipole: 5.4617
quadrupole: -134.1654 -95.3604 -105.3586
quadrupole: -12.3557 0.0144 -0.0030
quadrupole: -22.5373 16.2678 6.2695 -12.3557 0.0144 -0.0030
hfenergy: -1512.6485512 hartree
pointgroup: C01 [X(C8H4N2O4S2)]
dipole: -1.3864117 -1.6416867 -0.0008935 debye
dipolederiv: 0.264628 0.0743155 0.0000164 -0.0065162 -0.0937504 0.0000845 0.0000604 0.0001105 0.2333168 -0.0776554 0.1512661 0.0000369 -0.2290842 -0.3734456 0.0001057 0.0001158 0.0000817 0.1575709 -0.2855323 -0.1689105 -0.000087 0.1295587 -1.2236441 -0.0000499 -0.0001921 -0.0010534 -0.3997345 -1.220158 0.0186339 0.0001666 0.2090172 -0.4277601 -0.000256 -0.0013371 0.000227 -0.227434 -0.5650361 -0.073697 -0.0001517 -0.4110236 -0.8119264 0.0004427 -0.0003825 -0.0006078 -0.2255776 -1.2816362 0.0039897 -0.0006144 0.2034517 -0.5979928 -0.0002645 0.001238 0.0000395 -0.3280822 0.0312967 0.0855865 -0.000076 0.0268518 -0.5982123 0.0001271 0.0000169 0.0003398 -0.139334 2.2788259 0.3547736 0.0002531 0.7635669 1.22175 0.00005 0.0009997 0.0000792 0.2223124 0.2789942 0.0912837 -0.0000424 -0.265732 0.1467057 -0.0002123 0.0002 -0.0000415 -0.1042237 0.363993 0.1595329 -0.0000161 0.5703941 0.6601121 -0.0002142 -0.0003274 -0.0001916 -0.0212335 -0.5332975 0.0424294 -0.0000905 0.2582733 -0.006182 -0.0000069 0.000006 -0.0000677 -0.1345817 -0.9442783 -0.4701715 -0.0001251 -0.8867674 -0.1589596 -0.0002999 0.000324 0.0001122 -0.0923057 0.3279743 0.0063156 0.0000047 0.3171046 -0.0098777 0.0000888 0.0003396 0.0001157 -0.0686127 -0.4833579 0.1401966 0.0001763 -0.0960346 -0.3437624 -0.0000624 -0.0002756 0.0001871 0.0915122 -0.2874558 -0.2540636 0.0000518 0.127457 0.32218 -0.0000989 -0.0002701 0.00007 -0.2277028 1.7411223 -0.2044309 0.0003635 -0.6689094 1.6754278 0.0005845 -0.0005629 0.0007037 0.2504952 0.0933379 -0.0693932 -0.0000087 -0.0714298 0.009104 0.0000578 -0.0001283 0.0000204 0.1900761 0.0699022 0.0310824 -0.0000128 0.0238245 0.1050621 0.0000283 -0.0000319 0.0000391 0.2019864 0.1225964 0.0016986 0.0000016 0.028866 0.138886 0.0000187 -0.0000247 0.0000115 0.2197449 0.1057367 0.079562 0.0001538 -0.0228688 0.3662856 -0.000123 0.0002322 -0.0001754 0.4018074 unknown
polarizability: 311.8549352|14.4430396|169.9601288|0.0100051|-0.003598|53.1131247 unknown
InChI: InChI=1S/C8H4N2O4S2/c11-8(12)4-3-15-7(9-4)5-1-2-6(16-5)10(13)14/h1-3,11H
charge 0 multiplicity 1
20 atoms
S  1.458867 0.90756 -0.000739
S  -1.743593 -2.346581 0.000154
O  -3.575692 2.298976 0.000731
O  5.372457 0.103817 0.001082
O  4.184117 2.070616 0.000593
O  -5.268798 0.701241 0.000704
N  -1.602247 0.332167 -0.000547
N  4.266193 0.776071 -0.000772
C  0.629645 -0.700955 -0.000258
C  -0.811167 -0.731767 -0.000273
C  1.53992 -1.767283 0.000083
C  3.031136 0.031943 -0.000513
C  2.904199 -1.354228 -0.000026
C  -2.954184 -0.011918 -0.000601
C  -3.230502 -1.3793 -0.000177
C  -4.047818 0.992174 -0.001103
H  1.231199 -2.81583 0.000389
H  3.765034 -2.024138 0.0002
H  -4.213164 -1.84592 -0.000152
H  -4.350902 2.923857 0.002024
