program: Gaussian 09
title: 000092538
version: EM64L-G09RevD.01
frameworkgroup: C1[X(C18H18N2O2)]
method: RPBEPBE
basis: SDD
operation: Freq
keyword: #p
keyword: freq=noraman
keyword: PBEPBE/SDD
title: #p freq=noraman PBEPBE/SDD
converged: YES YES NO NO
title: Mulliken charges:
elementType: O O N N C C C C C C C C C C C C C C C C C C H H H H H H H H H H H H H H H H H H
charge: -0.251934 -0.252272 -0.132612 -0.133084 0.025784 0.027227 0.326294 0.326613 -0.087068 -0.086736 0.233326 0.232700 -0.380179 -0.380161 -0.386038 -0.385973 -0.667855 -0.661302 -0.667888 -0.661013 -0.234212 -0.234219 0.238453 0.238290 0.282537 0.282574 0.245354 0.223147 0.248191 0.244252 0.286145 0.216068 0.223030 0.248338 0.245287 0.216025 0.243936 0.286469 0.231256 0.231254
chargesum: 0.00000
title: Mulliken charges with hydrogens summed into heavy atoms:
elementType: O O N N C C C C C C C C C C C C C C C C C C
charge: -0.251934 -0.252272 -0.132612 -0.133084 0.025784 0.027227 0.326294 0.326613 -0.087068 -0.086736 0.233326 0.232700 -0.141726 -0.141872 -0.103501 -0.103399 0.048837 0.085162 0.048767 0.085417 -0.002957 -0.002965
polarizability: 3.47489311e+02 -1.35624685e-02 2.94569924e+02 -8.67342569e-03 5.97299704e+00 1.15897647e+02
1716.lowfreq: -5.9072 -0.0845 -0.0001 0.0007 6.2395 6.8027 40.2002 57.1203 64.2537
frequency: 40.1868 57.1129 64.2526 88.2101 98.0336 126.4031 146.3216 173.4436 180.4608 191.7857 211.3629 219.6657 234.1416 249.8759 255.9144 268.8421 300.1511 308.0064 315.1139 328.7561 359.5177 361.6212 381.0966 424.6629 426.0937 445.8783 472.9200 478.1550 493.3093 510.2962 530.0754 581.3726 607.9109 644.6846 652.9659 661.9159 713.5407 724.1170 742.3716 798.2953 803.0363 809.9271 826.0896 837.7371 903.5088 916.4221 919.3541 946.4799 988.5945 991.4961 1008.0574 1024.1564 1061.6323 1062.1696 1075.7844 1083.7781 1090.5609 1090.8762 1117.8676 1118.2893 1158.2256 1162.5512 1164.9983 1187.6764 1194.3683 1227.1149 1230.9813 1252.9493 1275.6947 1302.3180 1337.3575 1366.9174 1369.0546 1396.7485 1399.0090 1406.6536 1429.7229 1432.8069 1440.6150 1453.2760 1453.9016 1461.1241 1463.4142 1469.2833 1476.7091 1484.0697 1485.6331 1486.4814 1502.0271 1504.3775 1505.7896 1522.4795 1534.1628 1588.8557 1606.9850 1620.4538 2939.0848 2939.5866 2956.3215 2957.3540 3041.3267 3041.6900 3047.6946 3047.9131 3074.3809 3074.9080 3095.6067 3096.0079 3128.8388 3143.8441 3145.9332 3159.5779 3167.0169 3167.7792
redmass: 4.9329 3.7901 3.1467 3.0589 2.9361 3.4345 3.3803 1.7008 1.4529 2.1899 5.5008 3.9512 2.5109 1.1473 1.2017 3.8542 4.4628 3.8032 3.7423 3.1429 9.2309 5.2045 5.4532 3.4105 6.4518 2.8143 5.7152 3.7867 5.6466 3.5991 5.6302 3.7143 4.0811 6.5576 6.2146 4.9303 5.6042 2.6483 5.9893 1.6758 6.4141 2.0081 4.5823 4.9522 6.2875 1.5996 4.0262 1.3329 2.0252 1.7066 1.3407 2.3482 1.4817 1.4974 2.3808 2.4714 1.2469 1.2383 1.3741 1.3691 2.4732 2.0099 1.1608 1.8279 1.7358 2.3330 2.0962 2.3749 4.8906 2.6562 5.5893 2.3191 4.9206 8.6991 2.0666 1.4874 1.2352 1.3253 2.0928 1.0819 1.0856 2.4484 1.3444 1.3503 1.4176 1.0931 1.0663 1.0565 1.5002 1.8614 2.7630 4.4140 5.5546 7.4684 6.6014 6.8146 1.0456 1.0454 1.0354 1.0357 1.0979 1.0979 1.0867 1.0866 1.1011 1.1010 1.1012 1.1011 1.0858 1.0856 1.0903 1.0941 1.0962 1.0994
irintensity: 3.9285 0.0085 3.2587 0.2219 1.5008 1.1308 9.1515 0.0076 0.8731 4.6804 0.4288 4.9351 0.7083 0.2630 4.8645 12.5661 0.3702 0.7700 6.6648 2.4370 31.1069 0.2714 0.8485 0.9895 0.0458 0.1380 3.1464 0.6173 2.0051 2.2048 5.7864 10.1977 8.7439 8.3119 1.0318 2.8192 1.3593 29.1930 3.2632 74.2913 1.8199 15.7702 3.0448 5.7026 1.7560 2.3511 45.9703 4.3865 51.4296 41.3805 0.8865 23.0449 16.6249 6.1327 23.7744 3.7124 2.8601 4.1177 3.7259 2.7299 5.4654 38.6882 29.6484 54.6823 2.9415 0.8998 113.6159 2.7660 324.2655 10.1860 22.7255 11.4786 9.3644 56.5690 54.9442 11.0806 0.0053 30.9228 13.2979 59.6440 40.6315 2.4500 0.0031 22.3365 7.1941 0.8651 30.0571 0.5294 13.4445 57.7738 66.7259 53.3734 411.2542 19.3843 0.0647 28.7560 63.5965 188.6491 126.4854 2.6378 38.9414 24.1863 22.0705 23.2971 22.9419 20.5608 29.1411 10.9166 4.4549 5.8225 14.1313 3.7398 38.9447 26.7155
temp: 298.150 k
press: 1.00000 atm
elementType: 8 8 7 7 6 6 6 6 6 6 6 6 6 6 6 6 6 6 6 6 6 6 1 1 1 1 1 1 1 1 1 1 1 1 1 1 1 1 1 1
symmnumber: 1
zpe: 838129.5 jmol-1
zpe.correction: 0.319227 hartree
zpe.thermalcorrener: 0.339037 hartree
zpe.thermalcorrenthalpy: 0.339981 hartree
zpe.thermalcorrgfe: 0.272218 hartree
zpe.sumelectzpe: -955.085914 hartree
zpe.sumelectthermal: -955.066104 hartree
zpe.sumelectthermalent: -955.065160 hartree
zpe.sumelectthermalfe: -955.132922 hartree
dipole: -4.1512 0.0202 -0.0066
dipole: 4.1512
quadrupole: -101.9613 -114.4283 -135.5010
quadrupole: -0.0188 -0.0395 -10.6496
quadrupole: 15.3355 2.8685 -18.2041 -0.0188 -0.0395 -10.6496
hfenergy: -955.4051406 hartree
pointgroup: C01 [X(C18H18N2O2)]
dipole: 1.6332137 -0.0040499 -0.0022948 debye
polarizability: 347.4890541|0.1182907|293.7405036|0.0346675|-13.5361505|116.727324 unknown
InChI: InChI=1S/C18H18N2O2/c1-19(2)13-9-10-14(20(3)4)16-15(13)17(21)11-7-5-6-8-12(11)18(16)22/h5-10H,1-4H3
charge 0 multiplicity 1
40 atoms
O  -0.751947 -2.505766 1.145093
O  -0.753011 2.508196 -1.139743
N  1.846895 -2.837745 -0.13536
N  1.849205 2.837765 0.133801
C  0.527069 -0.724111 0.093555
C  0.527269 0.724899 -0.092332
C  1.764669 -1.453495 0.010867
C  1.765582 1.453258 -0.010571
C  -0.730633 -1.377791 0.528273
C  -0.730582 1.378872 -0.525183
C  -2.01219 -0.650059 0.287203
C  -2.012056 0.650013 -0.286045
C  2.986001 -0.694102 -0.007121
C  2.986198 0.692804 0.009554
C  -3.243506 -1.289834 0.580594
C  -3.24336 1.288998 -0.581261
C  3.070338 -3.56744 0.23758
C  0.796108 -3.637726 -0.771738
C  3.071859 3.567016 -0.241951
C  0.80137 3.638219 0.774948
C  -4.462938 -0.647015 0.292899
C  -4.462823 0.645236 -0.295887
H  3.945213 -1.21873 -0.04814
H  3.945473 1.217156 0.053681
H  -3.209884 -2.289329 1.02554
H  -3.209673 2.288743 -1.025638
H  3.555939 -3.099978 1.110224
H  3.804959 -3.626081 -0.593921
H  2.796555 -4.597269 0.523987
H  0.205395 -3.005395 -1.457757
H  0.094112 -4.059786 -0.026169
H  1.268468 -4.447886 -1.357843
H  3.804004 3.634562 0.591085
H  2.796416 4.593796 -0.538008
H  3.560677 3.093289 -1.109248
H  1.276594 4.450002 1.356363
H  0.215439 3.006461 1.465774
H  0.094419 4.057734 0.032768
H  -5.412558 -1.144973 0.518521
H  -5.412365 1.142493 -0.523392
