program: Gaussian 09
title: 000092453
version: EM64L-G09RevD.01
frameworkgroup: C1[X(C14H24O6)]
method: RPBEPBE
basis: SDD
operation: Freq
keyword: #pfreq=noraman
keyword: PBEPBE/SDD
title: #p freq=noraman PBEPBE/SDD
converged: YES YES NO NO
title: Mulliken charges:
elementType: O O O O O O C C C C C C C C C C C C C C H H H H H H H H H H H H H H H H H H H H H H H H
charge: -0.268974 -0.312398 -0.224957 -0.261879 -0.216234 -0.234514 0.271614 -0.012314 -0.750349 0.201746 -0.226648 -0.210375 -0.688784 -0.694517 0.175605 -0.178735 -0.228486 -0.232884 -0.680050 -0.667904 0.219170 0.272075 0.232186 0.232978 0.213167 0.217660 0.207207 0.230577 0.217456 0.203332 0.206581 0.242606 0.212086 0.277109 0.230408 0.229540 0.225749 0.218622 0.222926 0.229790 0.209822 0.242844 0.234516 0.212629
chargesum: 0.00000
title: Mulliken charges with hydrogens summed into heavy atoms:
elementType: O O O O O O C C C C C C C C C C C C C C
charge: -0.268974 -0.312398 -0.224957 -0.261879 -0.216234 -0.234514 0.271614 -0.012314 -0.026918 0.201746 0.219497 0.214491 -0.037419 -0.033244 0.175605 0.098375 0.231462 0.211486 -0.017513 0.022086
polarizability: 2.19955467e+02 2.32078396e-01 1.78049656e+02 1.07450958e+00 -1.65334918e+00 1.52633890e+02
1716.lowfreq: -11.9934 -10.6798 -5.4854 0.0005 0.0006 0.0008 5.8068 11.6528 13.0368
frequency: -4.2404 8.8871 12.4930 27.1086 40.3071 55.1831 69.9158 72.2933 81.4257 96.9213 101.7227 108.5705 113.9614 138.5987 153.8572 183.5538 211.6901 223.8923 225.9858 232.6109 236.6526 242.2020 254.4113 259.6332 262.7924 285.3287 301.1657 321.5768 348.0036 356.0748 366.3628 416.0300 457.1869 483.9404 499.0903 536.1036 576.4414 667.2790 720.4707 728.0414 757.1390 795.8103 799.9488 806.2705 808.1660 813.6147 820.4354 827.0780 866.7780 904.5253 909.3171 929.1345 949.6181 1023.1741 1024.3911 1032.6318 1044.0155 1076.8744 1093.9146 1100.9905 1108.6696 1110.7135 1120.3337 1130.5234 1132.4307 1133.5544 1137.8027 1142.2696 1181.3967 1209.4844 1245.7736 1255.9354 1260.0744 1261.5233 1283.7673 1329.8746 1353.5880 1358.5017 1369.6996 1371.6873 1377.0389 1391.0279 1393.0965 1397.1958 1400.8950 1456.8488 1458.9667 1459.4073 1460.2075 1461.3741 1469.1929 1471.4943 1472.1071 1480.0193 1481.6559 1484.7155 1487.4505 1491.7234 1493.6746 1522.7965 1618.2356 1631.3813 2967.2249 2973.0397 2982.2989 2988.1399 2989.1643 2991.7872 3001.4434 3005.4535 3010.5381 3027.9008 3040.0899 3048.2773 3066.0665 3084.4851 3085.7220 3087.9294 3092.2479 3096.6009 3098.0528 3098.8211 3102.5014 3107.5959 3112.6342 3124.2278
redmass: 3.9111 2.0158 2.7544 3.8136 2.8384 3.0905 2.1645 3.9260 2.2173 3.4833 3.0546 3.8992 3.8330 3.6640 2.8404 2.6128 3.1110 2.5381 1.6089 1.1616 2.2494 1.4319 1.7089 1.7590 1.7216 3.1344 3.6953 2.9846 4.5163 3.3637 5.5264 4.4085 4.4211 4.8934 5.4281 6.1268 5.4706 4.0335 8.2628 5.9979 4.8846 1.2184 2.3902 1.3579 2.1293 1.1102 1.2006 2.4517 4.1092 3.3000 4.1763 1.5269 2.5700 2.4956 2.4587 3.0564 3.1383 6.1410 2.0139 2.6131 2.1504 2.2259 2.3994 1.4390 1.4894 1.5330 1.6324 2.3976 3.7608 3.0466 1.1403 1.1605 1.1457 1.1594 5.3761 1.4401 1.3797 1.3001 1.4259 1.3214 1.2335 1.2590 1.2867 1.2715 1.2584 1.0526 1.0414 1.0392 1.0424 1.0415 1.0734 1.0807 1.0614 1.0512 1.0513 1.0701 1.0748 1.0862 1.0752 7.2920 7.1725 11.9044 1.0559 1.0583 1.0558 1.0357 1.0362 1.0357 1.0367 1.0355 1.0583 1.1060 1.1041 1.1083 1.1050 1.0991 1.0988 1.0988 1.0918 1.1013 1.1016 1.0988 1.1023 1.1007 1.1020 1.0997
irintensity: 2.3164 0.3148 1.1983 0.4174 0.3364 1.6938 0.5668 1.7579 1.3477 2.6943 1.0387 0.7942 0.1269 0.9221 6.2893 3.9714 7.1324 0.1083 1.5935 0.6926 3.3313 4.0502 0.9691 3.3575 6.6958 0.3527 5.6040 2.5684 15.5903 7.8809 0.5491 1.4936 2.6100 6.7769 8.8133 1.7534 2.3507 8.8351 9.1375 5.5930 16.1777 12.6346 20.2526 3.8049 23.8538 3.5562 4.9358 9.1787 17.8234 96.6506 89.7909 22.6402 58.3752 93.2404 96.6990 137.4306 42.7537 343.1858 48.1532 109.8273 8.2315 9.4644 29.8809 11.9121 7.8714 14.1002 47.7864 80.3327 74.8245 316.6795 0.5427 1.3281 0.9640 0.3150 16.2866 31.8642 42.6359 8.0918 50.7075 27.1426 21.0551 22.7225 22.9320 20.0114 56.8975 12.2358 9.5822 13.6841 10.2170 13.7212 30.3808 24.0024 4.3733 6.1428 11.4866 12.9566 5.4220 8.8186 6.3298 276.6605 286.6312 168.7062 54.4500 33.9416 47.3783 20.6607 29.0426 22.0460 18.3704 14.8111 20.2891 21.0526 11.6391 21.0968 6.5388 50.2150 39.7493 35.6353 0.6810 34.8717 29.8350 30.6718 42.5662 19.6366 29.9919 7.0400
temp: 298.150 k
press: 1.00000 atm
elementType: 8 8 8 8 8 8 6 6 6 6 6 6 6 6 6 6 6 6 6 6 1 1 1 1 1 1 1 1 1 1 1 1 1 1 1 1 1 1 1 1 1 1 1 1
symmnumber: 1
zpe: 950444.7 jmol-1
zpe.correction: 0.362005 hartree
zpe.thermalcorrener: 0.386474 hartree
zpe.thermalcorrenthalpy: 0.387418 hartree
zpe.thermalcorrgfe: 0.304287 hartree
zpe.sumelectzpe: -997.576990 hartree
zpe.sumelectthermal: -997.552521 hartree
zpe.sumelectthermalent: -997.551577 hartree
zpe.sumelectthermalfe: -997.634708 hartree
dipole: 2.3646 1.9164 0.9735
dipole: 3.1956
quadrupole: -93.6016 -119.7615 -121.1077
quadrupole: -12.0545 8.1352 6.7847
quadrupole: 17.8887 -8.2712 -9.6174 -12.0545 8.1352 6.7847
hfenergy: -997.9389948 hartree
pointgroup: C01 [X(C14H24O6)]
dipole: 0.7684774 -0.8141087 -0.572101 debye
polarizability: 217.0985714|-4.0360283|178.5617961|-12.6287223|0.7219014|154.9786458 unknown
InChI: InChI=1S/C14H24O6/c1-6-17-10-11(13(16)18-7-2)12(15)14(5,19-8-3)20-9-4/h10H,6-9H2,1-5H3
charge 0 multiplicity 1
44 atoms
O  -2.533604 1.681115 0.034401
O  -1.430721 0.18975 1.568329
O  0.190372 2.914436 -0.119687
O  0.12502 -1.461746 -0.38128
O  3.239952 0.159765 -0.301638
O  1.19911 -1.330919 1.685882
C  -1.449876 1.535849 1.008977
C  -0.0508 1.754651 0.340841
C  -1.709614 2.636023 2.048303
C  0.96468 0.671645 0.279038
C  -2.383708 0.886694 -1.212561
C  -2.593078 -0.173766 2.408752
C  -3.742178 0.904938 -1.911298
C  -2.564294 -1.689545 2.601602
C  0.759889 -0.769627 0.658798
C  2.213483 1.054356 -0.154422
C  -0.046361 -2.928642 -0.16376
C  4.569034 0.730468 -0.679909
C  -0.759269 -3.477051 -1.396327
C  5.518057 -0.4451 -0.876882
H  -1.046345 2.50864 2.92105
H  -1.512535 3.613389 1.581859
H  -2.762246 2.604832 2.37482
H  -2.058468 -0.140922 -0.962181
H  -1.604711 1.358522 -1.844999
H  -3.52151 0.155893 1.902269
H  -2.511824 0.346794 3.383918
H  -4.061215 1.942792 -2.11037
H  -4.512646 0.420763 -1.285644
H  -3.683406 0.366682 -2.875461
H  -3.373957 -1.999802 3.287645
H  -1.597474 -2.003765 3.031502
H  -2.707538 -2.208951 1.637654
H  2.3976 2.110498 -0.404199
H  -0.62592 -3.079431 0.764462
H  0.953952 -3.376049 -0.018634
H  4.903689 1.396168 0.138431
H  4.445386 1.323098 -1.60735
H  -1.750175 -3.006446 -1.522083
H  -0.168217 -3.288739 -2.308992
H  -0.903524 -4.568326 -1.293741
H  5.595529 -1.039621 0.048695
H  5.162387 -1.104452 -1.68638
H  6.524971 -0.07536 -1.142331
