program: Gaussian 09
title: 000092421
version: EM64L-G09RevD.01
frameworkgroup: C1[X(C13H16O5)]
method: RPBEPBE
basis: SDD
operation: Freq
keyword: #pfreq=noraman
keyword: PBEPBE/SDD
title: #p freq=noraman PBEPBE/SDD
converged: YES YES NO NO
title: Mulliken charges:
elementType: O O O O O C C C C C C C C C C C C C H H H H H H H H H H H H H H H H
charge: -0.322178 -0.192786 -0.252564 -0.259001 -0.242989 -0.299963 -0.456289 -0.529451 0.211450 0.036623 -0.185952 -0.544790 -0.548390 0.064282 0.084268 0.215920 -0.222505 -0.671878 0.311971 0.273694 0.247633 0.212377 0.263524 0.264738 0.263284 0.260821 0.255881 0.264866 0.362760 0.229763 0.230278 0.212834 0.231171 0.230597
chargesum: 0.00000
title: Mulliken charges with hydrogens summed into heavy atoms:
elementType: O O O O O C C C C C C C C C C C C C
charge: 0.040582 -0.192786 -0.252564 -0.259001 -0.242989 0.012008 0.065039 -0.053550 0.211450 0.036623 0.078786 -0.020685 -0.027643 0.064282 0.084268 0.215920 0.237537 0.002724
polarizability: 2.38308177e+02 2.96043540e+00 1.44915312e+02 -1.10356008e+01 2.54632200e+00 1.15891732e+02
1716.lowfreq: -9.5295 0.0006 0.0007 0.0008 1.4374 9.3264 10.1198 15.5393 43.3349
frequency: 9.3932 15.2088 43.3328 47.3762 55.8738 61.8051 74.7367 90.3170 160.4302 165.1167 192.9253 202.3436 210.6732 259.5493 282.9548 297.9952 304.6728 339.9365 368.1397 379.2394 427.7947 451.2626 471.9998 544.2712 554.1509 561.4945 586.9833 623.3837 651.9095 718.6666 722.9945 742.8044 775.9716 799.0319 806.6205 826.2497 832.4999 853.7237 870.5773 908.1100 942.8195 967.2625 1000.3408 1020.4883 1038.1766 1044.4640 1060.9974 1072.6688 1091.0519 1108.7848 1112.7742 1125.7175 1130.8528 1135.6006 1142.1604 1161.9753 1197.2177 1228.4154 1239.4700 1248.0151 1273.0166 1283.6348 1293.4439 1306.8542 1321.0058 1345.9031 1359.8302 1367.3342 1402.8244 1433.6763 1447.9898 1451.0014 1463.6059 1473.6983 1474.1616 1486.1207 1524.5073 1548.6331 1610.1346 1629.7484 2985.1098 2985.6522 2996.7037 3012.0908 3041.0874 3066.6115 3068.5603 3070.7533 3073.9880 3093.0582 3108.5661 3113.0931 3166.3714 3185.4158 3224.3818 3479.2519
redmass: 4.6123 5.3218 3.5671 4.5501 2.7123 2.6752 5.3477 3.5354 2.6755 4.2324 3.6002 4.8259 3.0763 1.6721 5.5061 4.4241 4.4362 5.0913 3.7736 5.2274 5.1466 6.0096 3.5394 2.2671 3.3575 1.5707 2.7835 4.5803 3.3351 4.4786 6.0737 4.9938 1.4362 1.1048 2.8539 3.0656 1.3380 3.9389 1.7148 4.0446 3.4163 3.3218 5.9504 2.2996 1.9331 1.4604 1.2998 1.3402 1.3812 3.1607 2.3348 1.8299 1.6556 1.4802 2.0379 1.4999 2.2520 3.1646 1.3374 1.1382 1.4320 1.5875 1.9372 3.3639 1.3446 1.4369 2.3259 1.7362 1.2674 1.0775 1.0864 1.0837 1.0400 1.0625 1.2370 1.0681 5.5697 9.7322 8.0884 9.5501 1.0647 1.0638 1.0359 1.0583 1.0841 1.0960 1.0622 1.1066 1.0969 1.0985 1.1027 1.0579 1.0896 1.1081 1.1164 1.0639
irintensity: 3.5962 1.0875 1.4258 0.7449 0.4570 1.0011 6.2695 0.2954 1.1098 9.2894 0.3683 4.2061 5.1434 3.1757 9.9966 4.6026 7.3863 14.7387 4.4183 4.8259 8.3261 18.7166 5.0550 39.2348 19.5227 56.3675 16.5110 14.0442 6.6386 2.2143 10.9219 5.4545 8.0707 3.2763 25.7782 18.0076 4.3914 77.1172 2.8011 13.2145 60.9451 27.6217 51.0204 48.2239 12.7437 53.1793 8.6742 18.1094 1.5046 36.1607 20.7665 210.3817 172.9863 5.9407 49.1243 6.9855 46.2875 70.3385 39.8833 0.4878 77.3883 184.2463 70.4335 23.3645 1.5114 16.4775 95.4355 9.9922 19.2283 10.0742 30.6841 13.9789 12.3946 4.6271 19.3783 14.1272 157.7864 405.8955 339.9688 168.2537 7.1964 5.8095 21.6661 18.8367 6.6812 8.9204 16.7365 7.0263 11.7734 30.3132 41.9433 6.6816 8.9231 5.5419 5.5231 47.6500
temp: 298.150 k
press: 1.00000 atm
elementType: 8 8 8 8 8 6 6 6 6 6 6 6 6 6 6 6 6 6 1 1 1 1 1 1 1 1 1 1 1 1 1 1 1 1
symmnumber: 1
zpe: 702983.1 jmol-1
zpe.correction: 0.267752 hartree
zpe.thermalcorrener: 0.286321 hartree
zpe.thermalcorrenthalpy: 0.287266 hartree
zpe.thermalcorrgfe: 0.216873 hartree
zpe.sumelectzpe: -879.696890 hartree
zpe.sumelectthermal: -879.678321 hartree
zpe.sumelectthermalent: -879.677377 hartree
zpe.sumelectthermalfe: -879.747770 hartree
dipole: -1.6110 -1.4708 3.0637
dipole: 3.7610
quadrupole: -65.8569 -120.5702 -107.3985
quadrupole: 1.9266 0.5796 0.1843
quadrupole: 32.0849 -22.6283 -9.4566 1.9266 0.5796 0.1843
hfenergy: -879.9646425 hartree
pointgroup: C01 [X(C13H16O5)]
dipole: -0.6559306 0.8842832 -0.9885649 debye
polarizability: 238.675567|-5.2749499|141.3411812|7.563749|9.9579224|119.0984729 unknown
InChI: InChI=1S/C13H16O5/c1-2-18-13(17)8-5-9(14)11(10(15)6-8)12(16)7-3-4-7/h7-8,16H,2-6H2,1H3
charge 0 multiplicity 1
34 atoms
O  -3.236465 -1.346348 -0.930901
O  -1.013193 -2.594483 -0.302124
O  -1.449546 2.082624 0.907933
O  3.83229 0.415336 -0.575699
O  3.421891 -0.126828 1.654842
C  -3.638158 0.963785 -0.278886
C  -4.737756 0.99458 0.815282
C  -5.130372 0.883303 -0.659212
C  -2.715188 -0.202607 -0.366049
C  -1.377822 -0.211643 0.072831
C  1.533671 0.093755 0.081344
C  0.97002 -1.338551 0.215284
C  0.707682 1.020376 0.998811
C  -0.54173 -1.448732 -0.039102
C  -0.784849 1.022389 0.660928
C  2.997269 0.110508 0.498546
C  5.302975 0.437322 -0.281704
C  6.00812 0.7718 -1.591497
H  -3.141205 1.926159 -0.410434
H  -4.873555 1.943098 1.33951
H  -4.8551 0.102514 1.437501
H  -5.604336 -0.054995 -0.97856
H  -5.545886 1.759402 -1.163374
H  1.464901 0.432096 -0.967784
H  1.168292 -1.70757 1.242354
H  1.461748 -2.046167 -0.475232
H  1.048869 2.068973 0.952634
H  0.836198 0.688141 2.049461
H  -4.12762 -1.145316 -1.326312
H  5.484234 1.191189 0.505542
H  5.589418 -0.552399 0.117274
H  7.101075 0.803295 -1.429957
H  5.792743 0.011183 -2.361182
H  5.685187 1.75511 -1.973868
