program: Gaussian 09
title: 000092668
version: EM64L-G09RevD.01
frameworkgroup: C1[X(C22H20ClN5O7)]
method: RPBEPBE
basis: SDD
operation: Freq
keyword: #p
keyword: freq=noraman
keyword: PBEPBE/SDD
title: #p freq=noraman PBEPBE/SDD
converged: YES YES NO NO
title: Mulliken charges:
elementType: Cl O O O O O O O N N N N N C C C C C C C C C C C C C C C C C C C C C C H H H H H H H H H H H H H H H H H H H H
charge: 0.002659 -0.300518 -0.272835 -0.208959 -0.185465 -0.205753 -0.213060 -0.238896 -0.395953 -0.035668 -0.087417 0.013640 0.012096 0.245193 0.294412 0.275861 -0.370529 -0.079069 -0.382569 -0.370504 -0.293419 -0.277341 -0.380884 -0.260957 -0.244363 -0.246176 -0.267795 0.268960 0.305474 -0.194687 -0.544348 0.468155 -0.416787 0.301841 -0.755398 0.223492 0.246570 0.355044 0.240396 0.224242 0.276681 0.207583 0.213191 0.289647 0.228550 0.236601 0.208330 0.203097 0.234006 0.250677 0.336825 0.314473 0.255745 0.254925 0.240987
chargesum: 0.00000
title: Mulliken charges with hydrogens summed into heavy atoms:
elementType: Cl O O O O O O O N N N N N C C C C C C C C C C C C C C C C C C C C C C
charge: 0.002659 -0.300518 -0.272835 -0.208959 -0.185465 -0.205753 -0.213060 -0.238896 -0.040908 -0.035668 -0.087417 0.013640 0.012096 0.245193 0.294412 0.275861 0.099533 -0.079069 -0.142173 -0.146262 -0.016738 0.143433 -0.091237 -0.032407 -0.007762 0.165251 0.216887 0.268960 0.305474 -0.194687 -0.207523 0.468155 -0.102313 0.301841 -0.003742
polarizability: 8.44358720e+02 1.38676555e+01 3.38593273e+02 1.79658869e+01 -1.26228493e+01 1.98301460e+02
1716.lowfreq: -1.8044 -0.0019 -0.0013 -0.0011 2.0047 6.3645 10.8887 13.2160 19.6251
frequency: 10.8630 13.1540 19.6001 22.7095 29.7827 35.3766 37.2846 48.6365 51.0390 60.9201 68.4924 75.7077 93.0606 107.5379 108.7999 121.1782 122.6873 132.3537 152.3364 157.4352 167.8024 180.4709 193.2988 196.9763 207.3682 216.1001 228.8985 262.3912 282.1091 291.2815 305.9935 325.0316 327.9777 347.6227 362.2705 375.9512 385.7940 403.0515 418.7916 430.3564 453.2391 473.8796 479.3737 483.9878 484.7462 517.5159 523.7800 538.6097 566.7113 584.8446 594.2732 607.9142 612.3983 645.4422 659.6809 665.7480 668.9312 680.1245 694.4532 700.9238 730.3108 744.5821 763.8296 770.4456 776.7980 781.7489 793.0294 796.4958 809.4442 826.3707 834.9242 882.7648 890.3047 896.7756 908.3693 927.1256 945.9176 958.8179 963.2974 976.5089 988.7306 1007.3186 1012.1047 1019.3515 1034.8860 1039.0277 1047.4121 1051.7816 1058.5320 1066.8023 1100.2778 1116.0328 1125.9784 1138.8062 1156.4351 1164.3767 1176.8234 1180.9537 1190.0415 1192.2526 1194.3137 1201.8194 1214.3965 1215.8838 1237.1969 1252.2352 1259.0998 1297.0900 1320.4353 1335.4282 1338.8778 1347.8238 1354.6595 1361.3986 1364.8744 1367.0528 1385.8645 1399.3884 1402.8668 1407.3424 1414.1241 1426.1604 1440.6107 1450.4580 1454.5203 1455.9922 1459.1922 1462.8086 1464.6457 1474.2807 1482.7115 1506.8617 1547.5653 1551.1186 1552.8110 1588.1561 1600.3387 1624.3287 1658.2973 2946.4342 2952.6266 2966.8156 3003.0167 3003.1644 3015.2427 3025.6746 3044.9440 3091.0550 3096.3625 3122.8810 3138.8958 3139.9612 3152.4307 3158.2413 3171.6549 3177.0291 3186.0574 3193.4647 3488.4035
redmass: 8.4240 8.2371 10.7877 6.5695 4.9581 6.0353 7.9371 9.0139 10.3249 15.5680 5.5076 4.0564 3.4819 4.6565 1.3231 3.8901 5.9170 6.1622 12.5288 4.1595 5.9077 4.7406 5.4746 5.9561 4.4049 3.2387 4.3169 4.9176 4.1944 2.4670 9.5200 5.9220 9.5463 9.5809 9.0090 8.3057 6.8018 3.0567 3.8056 4.8405 5.4040 5.7878 7.0059 3.2226 3.7736 3.5938 7.6827 4.7473 3.1328 5.3396 2.4387 5.2329 4.7457 5.4949 7.2075 5.2795 6.9989 1.4353 10.8378 6.2999 5.1219 6.2968 5.1348 1.3876 2.5246 5.8612 3.0010 3.6385 4.7076 6.1642 1.6504 1.5654 6.1150 2.6293 4.6785 1.4142 2.6772 1.4333 1.3733 1.3823 1.7531 1.3464 3.7275 2.9324 2.8666 3.0586 1.6765 2.2347 1.9849 2.3838 2.6508 2.1075 5.2341 2.2595 1.8400 1.9458 3.7855 1.2281 1.3147 4.6991 3.2268 1.1756 1.4060 3.2992 1.1992 1.1535 1.7713 2.3151 1.8534 4.3476 1.3108 6.9862 1.8961 1.5817 2.3227 7.0136 1.2505 4.7018 1.8625 1.6916 7.5988 5.4448 3.0176 3.1551 1.1243 1.0950 1.0649 1.1087 1.8456 1.2591 1.1128 3.2818 4.1236 5.3124 6.6594 7.9790 6.9812 6.0674 9.7066 1.0568 1.0571 1.0650 1.0505 1.0871 1.1038 1.0632 1.0986 1.1070 1.0951 1.0865 1.0980 1.0934 1.0872 1.0956 1.0959 1.0973 1.0927 1.0925 1.0760
irintensity: 0.2848 0.6783 0.2144 0.4767 1.1944 0.5998 0.4337 0.1981 1.5005 0.0923 0.9212 1.0407 5.6338 2.0012 2.0772 4.1926 13.8315 6.3017 4.0909 4.6626 7.9316 6.6403 7.0251 2.4131 0.2704 6.7841 14.4040 3.8432 1.5008 9.7434 0.6655 11.5729 0.8508 9.6898 0.8263 10.1773 0.8316 1.7178 4.7984 13.0109 21.8956 6.3010 47.4899 7.6500 3.0398 6.1628 7.1525 23.0163 3.4436 14.8329 2.2659 31.0600 14.7569 10.0994 0.1425 26.2105 20.9837 126.5923 50.0146 21.7239 23.2175 29.3219 25.9715 89.9152 25.8386 82.9629 8.1836 17.2799 48.1961 149.6878 44.0000 0.9751 36.8522 13.6014 30.9710 22.8753 49.9586 22.4060 1.5123 3.7315 16.1501 0.4812 16.0368 32.2158 87.4001 102.5523 7.5372 18.8473 32.9363 183.0815 61.3809 62.1235 7.9770 28.6434 51.4893 23.5304 236.9801 73.5308 101.5497 1169.5032 289.2599 29.5833 203.9734 463.8612 36.4008 26.0512 16.9624 75.2098 92.1085 228.2037 53.2843 64.1577 153.3956 50.3470 76.2125 132.9707 46.0472 145.7540 10.3065 54.6022 5.1113 777.5917 11.8820 288.2968 11.8613 24.6558 17.3581 39.9340 97.7346 4.6708 6.4699 161.5820 195.7840 110.3984 46.9100 440.1678 434.8003 16.7026 253.4285 25.2449 123.5913 38.9720 15.6241 23.0280 77.8218 39.3356 22.7424 18.8449 8.1510 1.3399 21.1749 8.2339 7.6053 34.0503 17.6535 11.0119 11.0821 27.6204 480.2910
temp: 298.150 k
press: 1.00000 atm
elementType: 17 8 8 8 8 8 8 8 7 7 7 7 7 6 6 6 6 6 6 6 6 6 6 6 6 6 6 6 6 6 6 6 6 6 6 1 1 1 1 1 1 1 1 1 1 1 1 1 1 1 1 1 1 1 1
symmnumber: 1
zpe: 1045585.5 jmol-1
zpe.correction: 0.398242 hartree
zpe.thermalcorrener: 0.431335 hartree
zpe.thermalcorrenthalpy: 0.432279 hartree
zpe.thermalcorrgfe: 0.327204 hartree
zpe.sumelectzpe: -2107.992757 hartree
zpe.sumelectthermal: -2107.959664 hartree
zpe.sumelectthermalent: -2107.958720 hartree
zpe.sumelectthermalfe: -2108.063796 hartree
dipole: -15.2894 -0.8251 -5.0804
dipole: 16.1325
quadrupole: -265.0479 -195.1533 -215.1592
quadrupole: 25.1940 20.5447 18.5622
quadrupole: -39.9277 29.9668 9.9609 25.1940 20.5447 18.5622
hfenergy: -2108.3909996 hartree
pointgroup: C01 [X(C22H20Cl1N5O7)]
dipole: 6.0043288 1.8386365 -0.9229803 debye
polarizability: 844.2437548|24.4239064|232.3126854|-3.3180986|61.1854509|304.6970117 unknown
InChI: InChI=1S/C22H20ClN5O7/c1-14(29)35-11-10-34-9-8-24-19-6-7-20(17-5-3-2-4-16(17)19)25-26-22-18(23)12-15(27(30)31)13-21(22)28(32)33/h2-7,12-13,24H,8-11H2,1H3
charge 0 multiplicity 1
55 atoms
Cl -3.450488 0.143672 -2.684645
O  6.205636 1.637192 1.21858
O  7.232937 -0.389959 -0.583732
O  -5.362542 0.078965 3.490932
O  -3.267451 -0.479036 2.770951
O  -9.063861 -0.051932 0.372046
O  -8.659844 0.042611 -1.877783
O  8.79525 -2.119014 -0.54861
N  3.593905 1.395083 0.687771
N  -1.685935 -0.387398 -0.214516
N  -2.667482 0.234701 0.379947
N  -4.503657 -0.161395 2.551152
N  -8.265994 -0.004286 -0.644697
C  2.050286 -0.137768 -0.449282
C  2.306032 0.974439 0.465497
C  0.692335 -0.578476 -0.656479
C  3.996859 2.49086 1.575744
C  -0.396828 0.103924 0.024794
C  1.207508 1.607474 1.118923
C  3.105988 -0.802511 -1.152462
C  -0.107935 1.183815 0.89754
C  5.436526 2.88825 1.219805
C  0.441632 -1.669914 -1.545808
C  2.834644 -1.869536 -2.015955
C  1.492635 -2.30932 -2.209459
C  7.513031 1.729611 0.560103
C  8.062707 0.321473 0.429676
C  -3.997513 0.00566 0.084726
C  -4.963465 -0.060809 1.15451
C  -4.55234 0.048789 -1.244514
C  -6.349842 -0.050471 0.936056
C  -6.816471 0.000924 -0.387481
C  -5.924804 0.04805 -1.488446
C  7.723036 -1.647628 -0.98366
C  6.770671 -2.308955 -1.953731
H  3.337965 3.368261 1.441018
H  3.941505 2.180667 2.639704
H  4.388407 0.827793 0.37433
H  1.393013 2.413749 1.833561
H  4.147555 -0.479593 -1.039376
H  -0.94105 1.657448 1.426489
H  5.471062 3.354249 0.211485
H  5.839398 3.603778 1.965134
H  -0.595211 -1.984885 -1.688977
H  3.65159 -2.363377 -2.552966
H  1.285656 -3.145474 -2.88581
H  7.409768 2.199781 -0.440755
H  8.208857 2.341325 1.173335
H  9.115515 0.330781 0.095251
H  7.999995 -0.222649 1.388307
H  -7.043523 -0.094382 1.778816
H  -6.327305 0.077004 -2.503969
H  7.305655 -3.08085 -2.526247
H  5.953947 -2.795626 -1.389174
H  6.322134 -1.567885 -2.634948
