program: Gaussian 09
title: 000009524
version: EM64L-G09RevD.01
frameworkgroup: C1[X(C5H13FN)]
method: RPBEPBE
basis: SDD
operation: Freq
keyword: #p
keyword: freq=noraman
keyword: PBEPBE/SDD
title: #p freq=noraman PBEPBE/SDD
converged: YES YES NO NO
title: Mulliken charges:
elementType: F N C C C C C H H H H H H H H H H H H H
charge: -0.192066 -0.122237 -0.349476 -0.547265 -0.530805 -0.547601 -0.205271 0.288142 0.288435 0.276893 0.271869 0.267788 0.273884 0.269034 0.274063 0.276955 0.267968 0.271834 0.233761 0.234095
chargesum: 1.00000
title: Mulliken charges with hydrogens summed into heavy atoms:
elementType: F N C C C C C
charge: -0.192066 -0.122237 0.227101 0.269285 0.286176 0.269156 0.262585
polarizability: 6.38104623e+01 1.06301246e-01 5.55031159e+01 7.55820756e-03 -1.98904983e-03 5.43670146e+01
1716.lowfreq: -19.4764 -14.9371 -0.0007 -0.0006 0.0011 16.4364 48.8878 74.8223 185.0738
frequency: 44.1272 73.5911 185.0214 188.8281 239.9936 254.0703 312.8084 340.9909 350.4501 431.5224 439.2098 508.0199 735.8999 813.6276 884.1853 922.4305 936.1470 976.0338 1043.5157 1058.3442 1059.0166 1115.9274 1138.0553 1180.5189 1215.9431 1250.8780 1253.9245 1312.1145 1345.7217 1396.7630 1424.1227 1424.5857 1448.1499 1453.2410 1459.3631 1461.6644 1474.1678 1485.0987 1486.6157 1487.3065 1499.4174 3026.5166 3028.7249 3029.7171 3033.8308 3039.6065 3097.0175 3120.3256 3144.6616 3145.1583 3147.9019 3150.9065 3152.5796 3155.2550
redmass: 1.6954 2.5149 1.2584 3.7583 1.0575 1.0755 4.3825 2.2146 2.6329 2.2739 2.7430 2.7652 4.1698 1.1729 3.2861 2.6225 2.9381 6.6072 1.1965 1.2833 2.3656 1.5717 1.4103 1.2269 1.8194 1.4982 1.9581 1.2434 1.2521 1.2404 1.1545 1.1451 1.0948 1.0466 1.1001 1.0402 1.0801 1.0776 1.0522 1.0586 1.0644 1.0321 1.0322 1.0474 1.0439 1.0571 1.1100 1.1102 1.1057 1.1062 1.1053 1.1056 1.1061 1.1052
irintensity: 1.8054 5.0777 0.2588 4.9270 0.3948 0.0777 6.5918 0.0410 0.5996 0.0074 2.1451 0.7081 0.4748 7.6025 40.7275 13.7520 28.7422 42.4906 0.0340 0.1243 3.0477 0.1556 0.0868 0.3175 0.6198 0.9192 0.0382 3.0648 2.7618 2.2957 14.9014 20.5974 1.9554 1.2044 3.9995 0.6694 2.2496 39.9682 44.7604 28.6218 81.0789 1.5120 1.6696 4.6036 11.5739 8.0460 6.1831 9.7572 0.3733 0.1934 1.6401 5.3849 1.6169 6.6242
temp: 298.150 k
press: 1.00000 atm
elementType: 9 7 6 6 6 6 6 1 1 1 1 1 1 1 1 1 1 1 1 1
symmnumber: 1
zpe: 474819.5 jmol-1
zpe.correction: 0.180849 hartree
zpe.thermalcorrener: 0.190022 hartree
zpe.thermalcorrenthalpy: 0.190966 hartree
zpe.thermalcorrgfe: 0.146837 hartree
zpe.sumelectzpe: -352.043427 hartree
zpe.sumelectthermal: -352.034254 hartree
zpe.sumelectthermalent: -352.033310 hartree
zpe.sumelectthermalfe: -352.077439 hartree
dipole: -5.7100 -0.9743 -0.0023
dipole: 5.7925
quadrupole: -38.5356 -35.2306 -35.1768
quadrupole: -3.0553 -0.0077 0.0009
quadrupole: -2.2212 1.0837 1.1375 -3.0553 -0.0077 0.0009
hfenergy: -352.2242764 hartree
pointgroup: C01 [X(C5H13F1N1)]
dipole: -2.2214224 0.5077553 -0.0333281 debye
dipolederiv: -0.6219474 0.1067792 -0.006379 0.1601676 -0.3305483 0.0038163 -0.0069656 0.0032644 -0.2379852 -0.3990942 -0.0156625 -0.0002133 -0.0156959 -0.334415 0.000662 -0.0001163 0.0008897 -0.312362 0.3965111 -0.1253393 0.0073566 -0.2434296 0.0738997 -0.0026843 0.0106448 -0.0016148 0.0788616 0.0612106 -0.0144293 0.0379327 -0.0062501 0.1307856 -0.1160978 0.0435359 -0.1203298 0.2566147 0.1844194 0.1345853 -0.0043816 0.1725764 0.225401 -0.0047707 -0.0054195 -0.0052282 0.0636937 0.0630286 -0.0196751 -0.0394264 -0.0114974 0.1492531 0.1239959 -0.0455389 0.1278777 0.2364141 0.6196212 -0.1035823 0.0047842 -0.065249 0.4006163 0.0002674 0.003267 -0.000113 0.402845 0.0472069 -0.0168625 0.0478502 -0.010817 0.0720784 0.054205 0.0210496 0.0759413 0.0047269 0.0486984 -0.0181613 -0.0458974 -0.0111494 0.063626 -0.0583232 -0.0196747 -0.0800986 0.012738 0.1306908 0.0348447 0.0342197 0.0340414 0.0176613 -0.0822439 0.0175385 -0.0254057 0.0396736 -0.0336113 0.050232 -0.0019022 0.0148696 0.1195809 0.0196913 0.0546215 0.0044763 0.0963768 0.053483 -0.1051791 -0.011072 -0.0828534 0.0362572 0.0103625 -0.0438478 -0.0248489 0.0781475 0.0980583 0.0118517 -0.0716224 -0.0187751 0.0875673 0.0323227 -0.0331947 0.0726092 0.0009929 -0.0040661 0.0278274 -0.0019808 0.0896513 0.0337134 0.0042242 -0.0041609 0.003875 0.1351406 0.0967941 0.0179002 0.0716056 -0.0158616 0.0796959 -0.0381531 0.0355014 -0.0779703 0.0106137 0.1315904 0.0315053 -0.0349883 0.0309731 0.0258659 0.0836613 -0.0184899 0.0270219 0.0304263 0.0518029 -0.1042941 0.018564 -0.0793293 0.0379404 -0.008669 0.0497362 0.0260104 0.0776659 -0.0326052 0.0506752 -0.0041367 0.0113121 0.1174242 -0.0211249 -0.0579456 -0.0050238 0.0974698 0.0545589 0.0275704 -0.0134049 0.0225901 0.0013422 0.062938 -0.0251925 0.0997067 -0.0410931 0.0536494 0.0294141 0.0130921 0.0247261 -0.0077454 -0.0640797 0.0246514 -0.1010396 -0.0309608 unknown
polarizability: 63.7718757|-0.5675205|55.5398335|0.0953674|-0.0379754|54.3688836 unknown
InChI: InChI=1S/C5H13FN/c1-7(2,3)5-4-6/h4-5H2,1-3H3
charge 1 multiplicity 1
20 atoms
F  2.856028 -0.505172 0.043075
N  -0.894349 0.017385 -0.004965
C  0.51016 -0.622547 0.030964
C  -1.091634 0.82561 -1.28967
C  -1.924239 -1.117877 0.029686
C  -1.110793 0.920432 1.211449
C  1.69371 0.362929 0.010546
H  0.56508 -1.233958 0.947635
H  0.584833 -1.293849 -0.841407
H  -0.867657 0.183457 -2.155082
H  -2.137341 1.165135 -1.337485
H  -0.424283 1.699426 -1.287236
H  -1.78625 -1.700513 0.952969
H  -2.935703 -0.684737 0.008036
H  -1.775465 -1.765546 -0.84742
H  -0.904108 0.345205 2.126782
H  -0.439958 1.789702 1.153704
H  -2.15584 1.26534 1.215502
H  1.757683 0.960188 -0.914961
H  1.745424 1.011392 0.901681
