program: Gaussian 09
title: 000092457
version: EM64L-G09RevD.01
frameworkgroup: C1[X(C15H26O2)]
method: RPBEPBE
basis: SDD
operation: Freq
keyword: #pfreq=noraman
keyword: PBEPBE/SDD
title: #p freq=noraman PBEPBE/SDD
converged: YES YES NO NO
title: Mulliken charges:
elementType: O O C C C C C C C C C C C C C C C H H H H H H H H H H H H H H H H H H H H H H H H H H
charge: -0.250873 -0.252279 -0.365570 -0.376120 -0.397957 -0.363145 -0.467372 -0.318360 -0.197978 -0.149361 -0.478190 -0.446235 -0.163167 0.288729 -0.172660 -0.752598 -0.754413 0.190850 0.214291 0.209114 0.185220 0.200419 0.193321 0.227698 0.203153 0.199056 0.205831 0.220917 0.232396 0.221070 0.233776 0.203748 0.198872 0.209020 0.202126 0.218086 0.209272 0.249015 0.244908 0.248022 0.214364 0.274501 0.208500
chargesum: 0.00000
title: Mulliken charges with hydrogens summed into heavy atoms:
elementType: O O C C C C C C C C C C C C C C C
charge: -0.250873 -0.252279 0.039572 0.018214 -0.004217 0.067706 -0.062485 0.134954 0.023092 0.084416 -0.075571 -0.035089 0.054919 0.288729 0.036612 -0.010652 -0.057048
polarizability: 1.98366643e+02 -1.12716621e+01 1.83667857e+02 -1.81454079e+00 -3.14444561e+00 1.28747764e+02
1716.lowfreq: -10.7542 -0.0004 -0.0002 0.0005 3.6905 6.2486 17.0299 22.5142 36.4932
frequency: 14.1601 21.9404 36.4044 40.3320 45.2182 66.4860 67.9949 79.4122 91.8505 96.8249 104.6428 112.6476 132.4105 165.2873 205.4485 208.9386 215.4227 253.5275 276.0183 283.2694 318.0286 322.4539 353.7475 408.1458 436.2439 462.9448 472.5801 488.5579 509.3602 569.7614 623.7487 731.7911 748.1900 765.9458 775.2653 794.3820 822.8128 849.3503 861.2460 866.7015 900.9417 937.2734 946.3658 961.2888 973.2157 980.3695 994.7028 1002.5440 1011.0421 1032.8875 1043.6196 1050.2030 1060.0728 1074.4571 1082.6616 1097.0452 1103.4981 1113.9797 1122.2441 1166.4680 1178.9808 1183.3675 1207.2595 1220.9068 1229.5986 1254.6964 1272.5050 1276.1648 1282.4165 1288.5087 1291.4724 1291.4945 1301.5815 1312.4132 1322.2773 1329.8726 1343.0911 1348.8244 1357.8080 1369.9084 1384.6336 1403.4034 1452.2752 1453.6736 1455.8794 1456.0958 1458.2146 1461.6944 1462.7884 1465.1619 1469.3696 1470.3011 1483.7410 1484.7370 1643.8015 1683.1365 1688.2713 2949.4391 2956.8729 2957.8614 2959.2069 2966.1599 2966.8095 2974.9259 2988.2276 3005.9802 3006.6879 3014.2474 3019.0995 3019.6346 3031.0285 3032.1465 3033.2970 3046.1161 3052.9631 3060.4672 3061.5287 3068.7459 3083.5286 3088.2130 3099.0218 3099.5098 3141.0983
redmass: 3.7612 3.9261 4.6576 4.5379 1.0993 3.6997 2.9391 2.9315 2.2937 2.0874 2.4623 2.3964 2.8669 2.3669 2.5630 1.9030 1.3764 2.8485 2.8459 2.8274 2.7204 2.5794 2.5697 2.6301 3.1536 2.0877 3.0547 2.6508 2.3129 3.2246 4.2611 1.1439 1.3831 1.3967 1.9500 2.1461 1.7459 1.6702 2.2366 2.1348 1.7402 1.8536 3.9462 1.5274 1.1569 1.0910 1.8676 2.0082 2.0616 3.4328 1.6718 1.5282 2.3114 2.2425 1.7855 2.2757 2.3660 2.0826 2.1679 1.3767 1.4573 1.4231 3.5242 1.2827 1.3019 1.2844 1.2700 1.2385 1.2291 1.1613 1.1613 1.2348 1.1237 1.3205 1.3688 1.3232 1.4009 1.4384 1.5398 1.3320 1.2624 1.2253 1.1017 1.0520 1.0679 1.0766 1.1014 1.0719 1.0852 1.0480 1.0880 1.0913 1.0602 1.1005 8.5753 6.5305 6.1342 1.0621 1.0596 1.0637 1.0607 1.0387 1.0615 1.0622 1.0600 1.0951 1.0380 1.0999 1.0958 1.0580 1.0975 1.0998 1.0995 1.0933 1.1037 1.0933 1.0929 1.0899 1.0890 1.0980 1.0951 1.1083 1.1020
irintensity: 0.1813 0.3706 0.6868 0.2455 0.4909 1.0521 1.5341 0.5818 1.2215 0.2491 0.1891 0.8906 0.9445 1.6524 1.1031 2.0479 0.0693 2.8253 5.0169 12.1373 1.1943 0.8310 3.4893 1.3390 6.0566 0.0104 3.3496 2.2570 1.0175 3.9118 7.7987 16.7663 0.5264 7.2109 6.8070 3.3958 3.7103 0.4212 1.3021 5.5715 2.1757 17.6194 37.4164 2.1724 45.1620 54.6061 28.7446 69.3151 2.3212 18.3969 8.6618 0.9853 9.1790 3.4166 1.1853 3.0354 0.4009 5.2915 0.4158 4.6081 0.2527 0.0357 292.6630 1.3076 0.5525 15.2219 1.2538 3.3547 0.6141 1.0523 3.2249 1.0803 2.6308 1.5748 0.5042 1.7616 2.6058 3.0868 0.2698 2.5813 51.1399 13.1743 24.2528 18.8092 21.4573 10.0465 11.7459 4.6652 8.7420 7.7877 2.7955 8.9691 31.4545 16.4999 203.6408 0.0591 1.3246 27.2476 10.3131 68.6766 16.1441 39.7860 71.6810 39.1570 21.5467 2.8247 2.3465 23.5473 32.4798 44.6024 47.8313 14.6752 42.2409 22.4537 64.1399 7.8245 35.6450 37.9766 45.8265 50.2578 9.5137 32.0157 8.8945
temp: 298.150 k
press: 1.00000 atm
elementType: 8 8 6 6 6 6 6 6 6 6 6 6 6 6 6 6 6 1 1 1 1 1 1 1 1 1 1 1 1 1 1 1 1 1 1 1 1 1 1 1 1 1 1
symmnumber: 1
zpe: 987382.8 jmol-1
zpe.correction: 0.376074 hartree
zpe.thermalcorrener: 0.397598 hartree
zpe.thermalcorrenthalpy: 0.398542 hartree
zpe.thermalcorrgfe: 0.321549 hartree
zpe.sumelectzpe: -736.245168 hartree
zpe.sumelectthermal: -736.223644 hartree
zpe.sumelectthermalent: -736.222700 hartree
zpe.sumelectthermalfe: -736.299694 hartree
dipole: -0.7548 -1.7774 0.7653
dipole: 2.0772
quadrupole: -97.6611 -106.1166 -104.4437
quadrupole: 0.1844 -1.2954 1.2989
quadrupole: 5.0794 -3.3761 -1.7032 0.1844 -1.2954 1.2989
hfenergy: -736.6212423 hartree
pointgroup: C01 [X(C15H26O2)]
dipole: -0.246641 0.7140618 -0.3116457 debye
polarizability: 199.5237067|10.4158784|182.3414521|3.4311263|-3.2705778|128.9171053 unknown
InChI: InChI=1S/C15H26O2/c1-3-4-5-6-7-8-9-10-11-12-13-14-17-15(2)16/h3-4,7-8H,5-6,9-14H2,1-2H3
charge 0 multiplicity 1
43 atoms
O  -3.754389 1.332393 -0.07085
O  -3.286108 -0.908442 0.383144
C  1.153429 2.330254 -0.84761
C  -0.006172 2.274092 0.174264
C  2.460883 2.932308 -0.279107
C  -1.316357 1.736496 -0.448358
C  3.158521 2.047453 0.79821
C  -2.463646 1.736662 0.5697
C  3.698586 0.748115 0.234722
C  3.246084 -0.495538 0.54518
C  3.780179 -1.785846 -0.039034
C  2.705616 -2.60099 -0.827082
C  1.557041 -3.087219 0.035066
C  -4.036043 -0.03462 -0.11068
C  0.239195 -2.869473 -0.218176
C  -5.34061 -0.285795 -0.835969
C  -0.914882 -3.37479 0.617986
H  0.828927 2.933313 -1.720541
H  1.357839 1.308318 -1.224725
H  0.279088 1.631722 1.031149
H  -0.179557 3.291744 0.584072
H  3.174856 3.101706 -1.110782
H  2.245858 3.92927 0.158444
H  -1.155736 0.706153 -0.819306
H  -1.601182 2.362534 -1.316613
H  3.993002 2.632992 1.236516
H  2.455005 1.833909 1.625568
H  -2.669597 2.750986 0.950309
H  -2.254148 1.048124 1.408356
H  4.515736 0.845635 -0.499985
H  2.417355 -0.59883 1.263185
H  4.634907 -1.567676 -0.708778
H  4.169172 -2.431344 0.777173
H  2.314695 -1.985098 -1.659866
H  3.217766 -3.475068 -1.283539
H  1.837331 -3.672251 0.927071
H  -0.031107 -2.282827 -1.111564
H  -6.087001 0.48102 -0.574333
H  -5.716084 -1.289402 -0.587665
H  -5.172267 -0.230177 -1.926937
H  -1.52057 -4.110386 0.051261
H  -1.601978 -2.552029 0.888022
H  -0.558633 -3.867798 1.540408
